{"text_format":"1","workbook":"xlsx","n_sheets":6,"sheets":["Scoring Notes","Developer Scoring","MHDC Score","CB and US Counties","County Table","CHAS"],"not_rendered":{"charts":0,"images":0,"macros":1,"external_links":1,"defined_names":37,"comments":0,"pivot_tables":0},"unopened":[],"bounds":{"document_bytes":16777216,"sheet_cells":100000,"rows_first":2000,"rows_last":500,"rows_between":2000,"halvings":0,"cell_chars":16384,"cell_head_chars":4096},"cells_cut":0,"cells_raw":0,"read":"whole","date_system":"1900"}

{"sheet":"Scoring Notes","index":0,"n_rows":9,"n_cols":3,"rows_kept":9,"cut":false,"hidden":false,"merged":[]}
["Phase III - General Scoring:"]
[null,"Income Targeting:","Units for Income Targeting must be designated properly in the \"AMGI Designation\" column on the \"VIIa. Development Plan\" worksheet within the FIN-100."]
[null,"Mixed Income Development","A development must have at least 10% market rate units or 10% Income Averaging Units at 80% AMI to qualify for these points. The market rate units must be designated properly in the \"Market\" column under \"Primary Unit Designation\" on the \"VIIa. Development Plan\" worksheet within the FIN-100. 80% units qualifying under the Income Average Set-Aside must be designated at 80% in the \"AMGI Designation\" column on the \"VIIa. Development Plan\" worksheet within the FIN-100."]
[null,"Tenant Ownership","Developments must have a \"Homeownership Plan\" exhibit within their application package to qualify for points in this category."]
[null,"Permanent Supportive Housing / Vulnerable Population","Units must be designated properly in the \"SA - Vuln - Pop\" or \"SA - Permanent Supportive Housing\" column on the \"VIIa. Development Plan\" worksheet within the FIN-100. Rents for these units must meet rent guidelines specified in the QAP."]
[null,"Preservation","If the development has MHDC financing or is encumbered by a LURA and/or Regulatory Agreement with MHDC, it must have a preservation letter from MHDC. If the development has HUD financing, it must have both a MHDC and a HUD letter of preservation. If the development has Rural Development financing, it must have both a MHDC and a Rural Development letter of preservation."]
[null,"Extented Compliance","Developments must waive their right to opt-out and specify how many years they are extending their \"Compliance Period\" on the \"IX. Tax Credit Addendum\" spreadsheet within the FIN-100 to qualify for points in this category."]
[null,"Leveraged Funds","Points are only allowed for qualified funds that are permanent financing."]
[null,"Rental Assitance","The amount of rental assistance required to qualify for points in this category is calculated as the difference between net rent and 30% of household income. The minimum amount of available rent assistance per assisted unit must be at least 15% of net rent for a minimum of three years. Please see the Developer Guide for additional detail."]

{"sheet":"Developer Scoring","index":1,"n_rows":140,"n_cols":8,"rows_kept":140,"cut":false,"hidden":false,"merged":[[142,2,153,5],[5,5,5,6],[0,1,0,6],[57,2,57,4],[133,2,135,5],[1,3,1,6],[4,3,4,6],[2,5,2,6],[7,1,7,6],[139,2,140,5],[85,2,85,4]]}
[null,"Please complete BROWN colored cells"]
[null,"Property Name:"]
[null,"Target Population:",null,null,"   Type of Construction:   "]
[]
[null,"Developer:",null,null,null,null,null,{"$f":"IF(AND(D3=\"Family\",(OR(F3=\"New\",F3=\"New + Rehab\"))),1,IF(AND(D3=\"Senior\",(OR(F3=\"New\",F3=\"New + Rehab\"))),2,IF(AND(D3=\"Family\",(OR(F3<>\"New\",F3<>\"New + Rehab\"))),3,IF(AND(D3=\"Senior\",(OR(F3<>\"New\",F3<>\"New + Rehab\"))),4))))","v":false}]
[null,"County:",null,"Select","   Self-Score Total Points:   ",{"$f":"F122","v":0}]
[]
[null,"MHDC has NOT included the following categories for self-scoring: Services, Opportunity Area, Economic Development, Credit Efficiency and Development Team Prior Performance. However; questions about some of these categories need completed at the bottom of this spreadsheet."]
[]
[null,"v1.0.072823"]
[]
[]
[null,null,"Phase I - Threshold Documents"]
[]
[null,null,"Executed FIN-100",null,null,"Select"]
[]
[null,null,"Application Fee",null,null,"Select"]
[]
[null,null,"Questionnaire",null,null,"Select"]
[]
[null,null,"Financing Letters of Intent",null,null,"Select"]
[]
[null,null,"Notifications"]
[null,null,"Chief Executive of Local Jurisdiction",null,null,"Select"]
[null,null,"State Senator",null,null,"Select"]
[null,null,"State Representative",null,null,"Select"]
[null,null,"Executive Director of Local HFA",null,null,"Select"]
[]
[null,null,"Economic Impact to Missouri (provided in FIN-100)"]
[null,null,"Proposed Services",null,null,"Select"]
[null,null,"Number of employees in Missouri",null,null,"Select"]
[null,null,"Percent of hard and soft costs from MO based firms",null,null,"Select"]
[null,null,"Projected Medicaid Savings (Sr. and Supportive Housing only)",null,null,"Select"]
[]
[null,null,"Pass/Fail",null,null,{"$f":"IF(OR(F15=\"No\",F17=\"No\",F19=\"No\",F21=\"No\",F24=\"No\",F25=\"No\",F26=\"No\",F27=\"No\",F30=\"No\",F31=\"No\",F32=\"No\",F33=\"No\",F15=\"Select\",F17=\"Select\",F19=\"Select\",F21=\"Select\",F24=\"Select\",F25=\"Select\",F26=\"Select\",F27=\"Select\",F30=\"Select\",F31=\"Select\",F32=\"Select\",F33=\"Select\"),\"Fail\",\"Pass\")","v":"Fail"}]
[]
[null,null,"Phase II - Priority Scoring"]
[]
[null,null,"Priority Group"]
[null,null,"Workforce Housing",null,null,"Select"]
[null,null,"Non-Profit (as defined in section III of 2023 QAP)",null,null,"Select"]
[null,null,"Service Enriched including Veterans Housing",null,null,"Select"]
[null,null,"Permanent Supportive Housing, Vulnerable Populations, and Independence Enabling",null,null,"Select"]
[null,null,"Preservation",null,null,"Select"]
[null,null,"CDBG-DR",null,null,"Select"]
[null,null,"HOME CHDO",null,null,"Select"]
[null,null,"Opportunity Area (as defined in section III of 2023 QAP)",null,null,"Select"]
[null,null,"Opportunity Zone (as enacted under the 2017 Tax Cuts & Jobs Act)",null,null,"Select"]
[]
[null,null,"Phase II Points",null,null,{"$f":"IF(OR(F40=\"Yes\",F41=\"Yes\",F42=\"Yes\",F43=\"Yes\",F44=\"Yes\",F45=\"Yes\",F46=\"Yes\",F47=\"Yes\",F48=\"Yes\"),45,0)","v":0}]
[]
[null,null,"Phase III - General Scoring"]
[]
[null,null,"Development Characteristics "]
[]
[null,null,"Income Targeting (max 10 pts) (no more than 1 category)"]
[null,null,"Location",null,null,"Select"]
[null,null,{"$f":"IF(F57=\"SL/KC\",\">15% of units at 30% AMI (10 pts)\",IF(F57=\"Rural MSA\",\">12.5% of units at 30% AMI (10 pts)\",IF(F57=\"Rural Non-MSA\",\">10% of units at 30% AMI (10 pts)\",\"Select Location Above\")))","v":"Select Location Above"},null,null,0]
[null,null,{"$f":"IF(F57=\"SL/KC\",\">10% of units at 30% AMI (6 pts)\",IF(F57=\"Rural MSA\",\">7.5% of units at 30% AMI (6 pts)\",IF(F57=\"Rural Non-MSA\",\">5% of units at 30% AMI (6 pts)\",\"Select Location Above\")))","v":"Select Location Above"},null,null,0]
[null,null,{"$f":"IF(F57=\"SL/KC\",\">10% of units at 40% AMI (4 pts)\",IF(F57=\"Rural MSA\",\">7.5% of units at 40% AMI (4 pts)\",IF(F57=\"Rural Non-MSA\",\">5% of units at 40% AMI (4 pts)\",\"Select Location Above\")))","v":"Select Location Above"},null,null,0]
{"$rows_left_out":81}
{"sheet":"MHDC Score","index":2,"n_rows":142,"n_cols":14,"rows_kept":142,"cut":false,"hidden":true,"merged":[[69,12,69,13],[1,3,1,5],[3,3,3,5],[2,5,2,6],[143,1,147,7],[5,1,7,7],[56,2,56,4],[135,2,137,5],[84,2,84,4]]}
[]
[null,"Property Name:",null,{"$f":"'Developer Scoring'!D2:G2","v":0},null,null,"Total Points:   ",{"$f":"G121+G126+G128+G131+G134","v":0}]
[null,"Target Population:",null,{"$f":"'Developer Scoring'!D3","v":0},"   Type of Construction:   ",{"$f":"'Developer Scoring'!F3:G3","v":0}]
[null,"Developer:",null,{"$f":"'Developer Scoring'!D5:G5","v":0},null,null,"County:   ","Select"]
[null,null,null,null,null,null,null,{"$f":"IF(AND(D3=\"Family\",(OR(F3=\"New\",F3=\"New + Rehab\"))),1,IF(AND(D3=\"Senior\",(OR(F3=\"New\",F3=\"New + Rehab\"))),2,IF(AND(D3=\"Family\",(OR(F3<>\"New\",F3<>\"New + Rehab\"))),3,IF(AND(D3=\"Senior\",(OR(F3<>\"New\",F3<>\"New + Rehab\"))),4))))","v":false}]
[null,"MHDC has NOT included the following categories for self-scoring: Services; Opportunity Area; Economic Development and; Development Team Prior Performance. However, questions about some these categories need completed at the bottom of this spreadsheet."]
[]
[]
[]
[]
[]
[null,null,"Phase I - Threshold Documents"]
[]
[null,null,"Executed FIN-100",null,null,{"$f":"'Developer Scoring'!F15","v":"Select"},"Select"]
[]
[null,null,"Application Fee",null,null,{"$f":"'Developer Scoring'!F17","v":"Select"},"Select"]
[]
[null,null,"Narrative",null,null,{"$f":"'Developer Scoring'!F19","v":"Select"},"Select"]
[]
[null,null,"Financing Letters of Intent",null,null,{"$f":"'Developer Scoring'!F21","v":"Select"},"Select"]
[]
[null,null,"Notifications"]
[null,null,"Chief Executive of Local Jurisdiction",null,null,{"$f":"'Developer Scoring'!F24","v":"Select"},"Select"]
[null,null,"State Senator",null,null,{"$f":"'Developer Scoring'!F25","v":"Select"},"Select"]
[null,null,"State Representative",null,null,{"$f":"'Developer Scoring'!F26","v":"Select"},"Select"]
[null,null,"Executive Director of Local HFA",null,null,{"$f":"'Developer Scoring'!F27","v":"Select"},"Select"]
[]
[null,null,"Economic Impact to Missouri (provided in FIN-100)"]
[null,null,"Proposed Services",null,null,{"$f":"'Developer Scoring'!F30","v":"Select"},"Select"]
[null,null,"Number of employees in Missouri",null,null,{"$f":"'Developer Scoring'!F31","v":"Select"},"Select"]
[null,null,"Percent of hard and soft costs from MO based firms",null,null,{"$f":"'Developer Scoring'!F32","v":"Select"},"Select"]
[null,null,"Projected Medicaid Savings (Sr. and Supportive Housing only)",null,null,{"$f":"'Developer Scoring'!F33","v":"Select"},"Select"]
[]
[null,null,"Pass/Fail",null,null,{"$f":"'Developer Scoring'!F35","v":"Fail"},{"$f":"IF(OR(G14=\"No\",G16=\"No\",G18=\"No\",G20=\"No\",G23=\"No\",G24=\"No\",G25=\"No\",G26=\"No\",G29=\"No\",G30=\"No\",G31=\"No\",G32=\"No\",G14=\"Select\",G16=\"Select\",G18=\"Select\",G20=\"Select\",G23=\"Select\",G24=\"Select\",G25=\"Select\",G26=\"Select\",G29=\"Select\",G30=\"Select\",G31=\"Select\",G32=\"Select\"),\"Fail\",\"Pass\")","v":"Fail"}]
[]
[null,null,"Phase II - Priority Scoring"]
[]
[null,null,"Priority Group"]
[null,null,"Workforce Housing",null,null,{"$f":"'Developer Scoring'!F40","v":"Select"},"Select",null,null,"Workforce only for counties whose AMI is lower than the State Wide Median Income of $81,700"]
[null,null,"Non-Profit (as defined in section III of 2022 QAP)",null,null,{"$f":"'Developer Scoring'!F41","v":"Select"},"Select",null,null,"LIHTC Set-Aside and/or CHDO Set-Aside qualifies"]
[null,null,"Service Enriched including Veterans Housing",null,null,{"$f":"'Developer Scoring'!F42","v":"Select"},"Select"]
[null,null,"Special Needs, Vulnerable Populations, and Independence Enabling",null,null,{"$f":"'Developer Scoring'!F43","v":"Select"},"Select"]
[null,null,"Preservation",null,null,{"$f":"'Developer Scoring'!F44","v":"Select"},"Select",null,null,"Must have Preservation Letter to qualify - always MHDC and then RD or HUD if applicable"]
[null,null,"CDBG-DR",null,null,{"$f":"'Developer Scoring'!F45","v":"Select"},"Select"]
[null,null,"HOME CHDO",null,null,{"$f":"'Developer Scoring'!F46","v":"Select"},"Select",null,null,"Must be a qualified CHDO - Ask Julie Smith"]
[null,null,"Opportunity Area (as defined in section III of 2022 QAP)",null,null,{"$f":"'Developer Scoring'!F47","v":"Select"},"Select"]
[null,null,"Opportunity Zone (as enacted under the 2017 Tax Cuts & Jobs Act)",null,null,{"$f":"'Developer Scoring'!F48","v":"Select"},"Select",null,null,"https://ded.mo.gov/sites/default/files/Opportunity%20Zone%20List_0.pdf"]
[]
[null,null,"Phase II Points",null,null,{"$f":"IF(OR(F39=\"Yes\",F40=\"Yes\",F41=\"Yes\",F42=\"Yes\",F43=\"Yes\",F44=\"Yes\",F45=\"Yes\",F46=\"Yes\",F47=\"Yes\"),45,0)","v":0},{"$f":"IF(OR(G39=\"Yes\",G40=\"Yes\",G41=\"Yes\",G42=\"Yes\",G43=\"Yes\",G44=\"Yes\",G45=\"Yes\",G46=\"Yes\",G47=\"Yes\"),45,0)","v":0}]
[]
[null,null,"Phase III - General Scoring"]
[]
[null,null,"Development Characteristics "]
[]
[null,null,"Income Targeting (max 10 pts) (no more than 1 category)",null,null,null,null,null,null,"Income Averaging = unavailable points"]
[null,null,"Location",null,null,{"$f":"'Developer Scoring'!F57","v":"Select"},{"$f":"IFERROR(VLOOKUP(H4,'County Table'!A2:B117,2,FALSE),\"\")","v":"NA"},null,null,"The % per location will populate after the county is completed at top of spreadsheet"]
[null,null,{"$f":"IFERROR(IF(OR(G56=\"STL\",G56=\"KC\"),\">15% of units at 30% AMI (10 pts)\",IF(G56=\"OSM\",\">12.5% of units at 30% AMI (10 pts)\",IF(G56=\"OSR\",\">10% of units at 30% AMI (10 pts)\",\"Select County at Top\"))),\"Select County at Top\")","v":"Select County at Top"},null,null,{"$f":"'Developer Scoring'!F58","v":0},0]
[null,null,{"$f":"IFERROR(IF(OR(G56=\"STL\",G56=\"KC\"),\">10% of units at 30% AMI (6 pts)\",IF(G56=\"OSM\",\">7.5% of units at 30% AMI (6 pts)\",IF(G56=\"OSR\",\">5% of units at 30% AMI (6 pts)\",\"Select County at Top\"))),\"Select County at Top\")","v":"Select County at Top"},null,null,{"$f":"'Developer Scoring'!F59","v":0},0]
[null,null,{"$f":"IFERROR(IF(OR(G56=\"STL\",G56=\"KC\"),\">10% of units at 40% AMI (4 pts)\",IF(G56=\"OSM\",\">7.5% of units at 40% AMI (4 pts)\",IF(G56=\"OSR\",\">5% of units at 40% AMI (4 pts)\",\"Select County at Top\"))),\"Select County at Top\")","v":"Select County at Top"},null,null,{"$f":"'Developer Scoring'!F60","v":0},0]
[null,{"$f":"MAX(G57:G60)","v":0},{"$f":"IFERROR(IF(OR(G56=\"STL\",G56=\"KC\"),\">10% of units at 50% AMI (2 pts)\",IF(G56=\"OSM\",\">7.5% of units at 50% AMI (2 pts)\",IF(G56=\"OSR\",\">5% of units at 50% AMI (2 pts)\",\"Select County at Top\"))),\"Select County at Top\")","v":"Select County at Top"},null,null,{"$f":"'Developer Scoring'!F61","v":0},0]
{"$rows_left_out":83}
{"sheet":"CB and US Counties","index":3,"n_rows":120,"n_cols":16,"rows_kept":120,"cut":false,"hidden":true,"merged":[[0,0,0,26],[1,0,1,26]]}
["Severe Cost Burdened Renter Households"]
["(For use with 2023 QAP)"]
[]
["County","Total Households","Renter Households","Renter Households w/ 50% or more CB","% of All Households","Severe Cost Burden % of All Renter Households"]
["Adair",4012,664,224,0.33734939759036142,0.27363184079601988,10,0,null,null,null,null,null,null,null,1]
["Boone",6640,3095,878,0.2836833602584814,0.26538474202364098,10,0,null,null,null,null,null,null,null,1]
["Randolph",4298,1161,329,0.2833763996554694,0.25518672199170123,10,0,null,null,null,null,null,null,null,1]
["St. Louis City",4830,1512,408,0.26984126984126983,0.25285502290470352,10,0,null,null,null,null,null,null,null,1]
["Warren",8060,1363,351,0.2575201760821717,0.25009345794392523,10,0]
["Lincoln",71919,31631,8073,0.25522430527014639,0.24512195121951219,10,0,null,null,null,null,null,null,null,1]
["Phelps",4426,769,194,0.25227568270481143,0.23710601719197708,10,0,null,null,null,null,null,null,null,1]
["Ralls",143566,80228,19673,0.24521364112280003,0.23664122137404581,10,5,null,null,null,null,null,null,null,1]
["Texas",127532,55786,13350,0.23930735309934392,0.23106796116504855,10,0,null,null,null,null,null,null,null,1]
["Benton",4851,1432,324,0.22625698324022347,0.22657342657342658,10,0,null,null,null,null,null,null,null,1]
["Greene",9078,3489,785,0.22499283462310118,0.22629998122770789,10,0,null,null,null,null,null,null,null,1]
["Oregon",30215,10299,2262,0.21963297407515292,0.22535211267605634,10,0]
["Morgan",18213,7322,1592,0.21742693253209505,0.22302158273381295,10,0]
["Cape Girardeau",19818,3898,846,0.21703437660338634,0.22067932067932067,10,0]
["Madison",4973,978,212,0.21676891615541921,0.21708185053380782,10,0]
["Vernon",33642,12760,2749,0.21543887147335422,0.21601731601731602,10,0]
["Dunklin",291532,121133,26007,0.21469789405034137,0.21530054644808744,10,0]
["St. Louis",409658,129943,27736,0.21344743464442101,0.21469793615014468,10,0]
["Mississippi",8294,2165,461,0.21293302540415704,0.21336760925449871,10,0]
["Dent",13129,2689,569,0.21160282632949051,0.21165644171779141,10,5]
["Scott",1698,361,75,0.2077562326869806,0.20766129032258066,10,0]
["Hickory",15557,4943,1012,0.20473396722638074,0.20751879699248121,10,5]
["Jackson",8510,3567,724,0.20297168488926268,0.20477669303227355,10,0]
["Howell",3361,1050,213,0.20285714285714285,0.19830148619957538,7,0]
["Pemiscot",12119,4647,931,0.20034430815579943,0.19798657718120805,7,0]
["Barry",15342,5185,1029,0.19845708775313403,0.1963276836158192,7,0]
["Buchanan",3460,706,140,0.19830028328611898,0.19603078169299312,7,0]
["Nodaway",6342,1630,320,0.19631901840490798,0.19527834450597492,7,0]
["Crawford",46461,16903,3275,0.19375258829793529,0.19101123595505617,7,0]
["Ste. Genevieve",7281,2741,529,0.19299525720539948,0.1906474820143885,7,0]
["Maries",6977,1691,324,0.19160260201064458,0.18941798941798943,7,0]
["Johnson",9852,2347,449,0.19130805283340435,0.18883841661258924,7,0]
["Dallas",9798,2661,509,0.19128147313040211,0.18771331058020477,7,0]
["St. Francois",4998,1970,367,0.18629441624365481,0.1874116891457932,7,0]
["Jasper",4132,602,112,0.18604651162790697,0.18510573092246399,7,0]
["Bollinger",13872,3597,668,0.18571031415068112,0.18497109826589594,7,0]
["Pettis",16193,5000,895,0.17899999999999999,0.18290946083418108,7,0]
["DeKalb",8872,2568,457,0.1779595015576324,0.18274978650725876,7,0]
["Putnam",24572,7882,1402,0.17787363613296117,0.18157894736842106,7,0]
["Ray",22390,7721,1360,0.17614298665975911,0.18095739084692267,7,0]
["Lafayette",12711,3698,648,0.1752298539751217,0.17748344370860927,7,0]
["Washington",8766,1945,340,0.17480719794344474,0.17681940700808627,7,0]
["Stoddard",5438,1370,237,0.17299270072992701,0.1767467550400442,7,0]
["Taney",11833,3675,634,0.17251700680272108,0.17643540669856458,7,0]
["Butler",19931,7492,1282,0.17111585691404163,0.17600700525394045,7,0]
["Wright",41127,9362,1553,0.16588335825678274,0.17544757033248082,7,5]
["Cass",92514,29268,4854,0.16584665846658467,0.17512064343163539,7,0]
["Iron",17300,3207,528,0.1646398503274088,0.17446808510638298,7,5]
["Wayne",149472,27568,4521,0.16399448636099825,0.17391304347826086,7,0]
["New Madrid",6355,1810,295,0.16298342541436464,0.17293804637020144,7,5]
["Jefferson",1687,360,58,0.16111111111111112,0.17261556465769456,7,0]
["Chariton",40397,9921,1590,0.16026610220743875,0.1721170395869191,7,0]
["Ozark",6565,1963,314,0.1599592460519613,0.17197452229299362,7,0]
["Polk",6412,1576,252,0.15989847715736041,0.17194950911640955,7,0]
["Ripley",9284,2680,426,0.15895522388059702,0.16901408450704225,7,0]
["Pulaski",9278,2186,342,0.15645013723696249,0.16818361693707953,7,0]
{"$rows_left_out":61}
{"sheet":"County Table","index":4,"n_rows":117,"n_cols":5,"rows_kept":117,"cut":false,"hidden":true,"merged":[]}
["County","Region","County","PH Zone City","PH Zone #"]
["Adair","OSR","Adair","Columbia",2]
["Andrew","OSR","Andrew","Kansas City",1]
["Atchison","OSR","Atchison","Kansas City",1]
["Audrain","OSR","Audrain","Columbia",2]
["Barry","OSR","Barry","Springfield",4]
["Barton","OSR","Barton","Springfield",4]
["Bates","OSR","Bates","Kansas City",1]
["Benton","OSR","Benton","Columbia",2]
["Bollinger","OSM","Bollinger","St. Louis",3]
["Boone","OSM","Boone","Columbia",2]
["Buchanan","OSR","Buchanan","Kansas City",1]
["Butler","OSR","Butler","St. Louis",3]
["Caldwell","OSR","Caldwell","Kansas City",1]
["Callaway","OSM","Callaway","Columbia",2]
["Camden","OSR","Camden","Columbia",2]
["Cape Girardeau","OSM","Cape Girardeau","St. Louis",3]
["Carroll","OSR","Carroll","Kansas City",1]
["Carter","OSR","Carter","St. Louis",3]
["Cass","KC","Cass","Kansas City",1]
["Cedar","OSR","Cedar","Springfield",4]
["Chariton","OSR","Chariton","Columbia",2]
["Christian","OSR","Christian","Springfield",4]
["Clark","OSR","Clark","Columbia",2]
["Clay","KC","Clay","Kansas City",1]
["Clinton","OSR","Clinton","Kansas City",1]
["Cole","OSM","Cole","Columbia",2]
["Cooper","OSM","Cooper","Columbia",2]
["Crawford","OSR","Crawford","St. Louis",3]
["Dade","OSR","Dade","Springfield",4]
["Dallas","OSR","Dallas","Springfield",4]
["Daviess","OSR","Daviess","Kansas City",1]
["Dekalb","OSR","Dekalb","Kansas City",1]
["Dent","OSR","Dent","St. Louis",3]
["Douglas","OSR","Douglas","Springfield",4]
["Dunklin","OSR","Dunklin","St. Louis",3]
["Franklin","STL","Franklin","St. Louis",3]
["Gasconade","OSR","Gasconade","St. Louis",3]
["Gentry","OSR","Gentry","Kansas City",1]
["Greene","OSM","Greene","Springfield",4]
["Grundy","OSR","Grundy","Kansas City",1]
["Harrison","OSR","Harrison","Kansas City",1]
["Henry","OSR","Henry","Kansas City",1]
["Hickory","OSR","Hickory","Columbia",2]
["Holt","OSR","Holt","Kansas City",1]
["Howard","OSM","Howard","Columbia",2]
["Howell","OSR","Howell","Springfield",4]
["Iron","OSR","Iron","St. Louis",3]
["Jackson","KC","Jackson","Kansas City",1]
["Jasper","OSM","Jasper","Springfield",4]
["Jefferson","STL","Jefferson","St. Louis",3]
["Johnson","OSR","Johnson","Kansas City",1]
["Knox","OSR","Knox","Columbia",2]
["Laclede","OSR","Laclede","Springfield",4]
["Lafayette","OSR","Lafayette","Kansas City",1]
["Lawrence","OSR","Lawrence","Springfield",4]
["Lewis","OSR","Lewis","Columbia",2]
["Lincoln","OSR","Lincoln","St. Louis",3]
["Linn","OSR","Linn","Columbia",2]
["Livingston","OSR","Livingston","Kansas City",1]
{"$rows_left_out":58}
{"sheet":"CHAS","index":5,"n_rows":1148,"n_cols":8,"rows_kept":1148,"cut":false,"hidden":true,"merged":[]}
["County","Rent Burden <=30%","Rent Burden >30% to <=50%","Rent Burden >50%","Rent Burden not available","Total Rented","30% + 50% Rent Burdened","% Rent Burdened"]
["Clark",575,100,20,10,700,120,0.17391304347826086]
["Mercer",285,33,39,10,360,72,0.20571428571428571]
["Gentry",555,89,59,0,695,148,0.21294964028776978]
["Worth",185,38,18,4,240,56,0.23728813559322035]
["Atchison",570,113,70,10,765,183,0.24238410596026491]
["Shelby",510,125,40,4,675,165,0.24590163934426229]
["Lewis",785,145,115,10,1050,260,0.25]
["DeKalb",1045,205,144,4,1395,349,0.25089863407620416]
["Shannon",575,104,90,10,780,194,0.25194805194805192]
["Schuyler",365,48,85,15,515,133,0.26600000000000001]
["Holt",465,93,74,15,640,167,0.26719999999999999]
["Pike",1290,340,165,35,1830,505,0.28133704735376047]
["Daviess",475,90,99,4,665,189,0.28593040847201212]
["Maries",665,149,119,4,940,268,0.28632478632478631]
["Sullivan",430,75,100,10,620,175,0.28688524590163933]
["McDonald",1625,315,345,35,2325,660,0.28820960698689957]
["Knox",280,73,40,0,390,113,0.28974358974358977]
["Livingston",1215,239,270,115,1845,509,0.29421965317919074]
["Chariton",475,85,114,4,680,199,0.29437869822485208]
["Osage",595,179,78,35,880,257,0.30414201183431955]
["Lawrence",2785,623,600,50,4060,1223,0.30498753117206984]
["Andrew",1030,274,179,85,1570,453,0.30505050505050507]
["Ralls",495,75,145,0,715,220,0.30769230769230771]
["Bates",1330,350,250,10,1940,600,0.31088082901554404]
["Dallas",1125,244,270,20,1665,514,0.31246200607902735]
["Macon",1075,345,145,35,1595,490,0.3141025641025641]
["Cole",6255,1580,1385,310,9535,2965,0.3214092140921409]
["Scotland",315,50,100,4,465,150,0.32537960954446854]
["St Clair",615,180,115,10,915,295,0.32596685082872928]
["Harrison",685,165,172,10,1035,337,0.32878048780487806]
["Iron",810,179,225,25,1235,404,0.33388429752066118]
["Grundy",840,165,255,15,1270,420,0.33466135458167329]
["Monroe",610,200,110,15,940,310,0.33513513513513515]
["Linn",865,230,210,4,1310,440,0.33690658499234305]
["Audrain",1855,580,365,115,2910,945,0.33810375670840787]
["Perry",1065,385,175,10,1635,560,0.3446153846153846]
["Webster",2335,680,560,50,3625,1240,0.34685314685314683]
["Caldwell",600,129,194,10,940,323,0.34731182795698923]
["Dent",1065,340,230,55,1685,570,0.34969325153374231]
["Reynolds",340,80,105,4,530,185,0.35171102661596959]
["Pulaski",4930,1410,1285,150,7780,2695,0.35321100917431192]
["Cooper",1220,370,300,35,1925,670,0.35449735449735448]
["Washington",1040,260,320,25,1645,580,0.35802469135802467]
["Marion",2425,760,605,115,3915,1365,0.35921052631578948]
["Callaway",2830,840,745,65,4475,1585,0.35941043083900226]
["Moniteau",905,399,115,10,1430,514,0.36197183098591551]
["Clinton",1345,410,355,15,2125,765,0.36255924170616116]
["Ray",1235,465,235,10,1940,700,0.36269430051813473]
["Bollinger",550,170,149,40,915,319,0.36457142857142855]
["Ste Genevieve ",995,293,274,0,1555,567,0.36463022508038584]
["Newton",4035,1380,945,85,6450,2325,0.3652788688138256]
["Lafayette",2130,555,675,80,3445,1230,0.36552748885586922]
["Henry",1480,495,364,25,2360,859,0.36788008565310493]
["Wright",1440,445,405,80,2375,850,0.37037037037037035]
["Dade",435,119,138,10,700,257,0.37246376811594201]
["Miller",1415,575,280,15,2285,855,0.37665198237885461]
["Franklin",6700,2300,1765,130,10895,4065,0.37761263353460289]
["Clay",16380,5545,4394,315,26635,9939,0.37762158054711248]
["Morgan",1195,315,414,45,1970,729,0.37870129870129871]
{"$rows_left_out":1088}