{"text_format":"1","workbook":"xlsx","n_sheets":9,"sheets":["Scoring Notes","Developer Scoring","MHDC Score","CB and US Counties 2026","CB and US Counties","County Table","CB and US Counties NEW","CHAS","CHAS NEW"],"not_rendered":{"charts":0,"images":0,"macros":1,"external_links":1,"defined_names":40,"comments":0,"pivot_tables":0},"unopened":[],"bounds":{"document_bytes":16777216,"sheet_cells":100000,"rows_first":2000,"rows_last":500,"rows_between":2000,"halvings":0,"cell_chars":16384,"cell_head_chars":4096},"cells_cut":0,"cells_raw":0,"read":"whole","date_system":"1900"}

{"sheet":"Scoring Notes","index":0,"n_rows":8,"n_cols":3,"rows_kept":8,"cut":false,"hidden":true,"merged":[]}
["Phase III - General Scoring:"]
[null,"Income Targeting:","Units for Income Targeting must be designated properly in the \"AMGI Designation\" column on the \"VIIa. Development Plan\" worksheet within the FIN-100."]
[null,"Mixed Income Development","A development must have at least 10% market rate units or 10% Income Averaging Units at 80% AMI to qualify for these points. The market rate units must be designated properly in the \"Market\" column under \"Primary Unit Designation\" on the \"VIIa. Development Plan\" worksheet within the FIN-100. 80% units qualifying under the Income Average Set-Aside must be designated at 80% in the \"AMGI Designation\" column on the \"VIIa. Development Plan\" worksheet within the FIN-100."]
[null,"Homeownership Opportunity","Developments must have a \"Homeownership Plan\" exhibit within their application package to qualify for points in this category."]
[null,"Permanent Supportive Housing / Vulnerable Population","Units must be designated properly in the \"SA - Vuln - Pop\" or \"SA - Permanent Supportive Housing\" column on the \"VIIa. Development Plan\" worksheet within the FIN-100. Rents for these units must meet rent guidelines specified in the QAP."]
[null,"Preservation","If the development has MHDC financing or is encumbered by a LURA and/or Regulatory Agreement with MHDC, it must have a preservation letter from MHDC. If the development has HUD financing, it must have a HUD letter of preservation. If the development has Rural Development financing, it must have a Rural Development letter of preservation."]
[null,"Extended Compliance","Developments must waive their right to opt-out and specify how many years they are extending their \"Compliance Period\" on the \"IX. Tax Credit Addendum\" spreadsheet within the FIN-100 to qualify for points in this category."]
[null,"Rental Assistance","The amount of rental assistance required to qualify for points in this category is calculated as the difference between net rent and 30% of household income. The minimum amount of available rent assistance per assisted unit must be at least 15% of net rent for a minimum of five years. Please see the Developer Guide for additional detail."]

{"sheet":"Developer Scoring","index":1,"n_rows":136,"n_cols":8,"rows_kept":136,"cut":false,"hidden":false,"merged":[[7,1,9,6],[138,2,149,5],[5,5,5,6],[0,1,0,6],[60,2,60,4],[1,3,1,6],[4,3,4,6],[2,5,2,6],[135,2,136,5],[91,2,91,4],[97,2,97,4],[1,1,1,2],[2,1,2,2],[4,1,4,2],[5,1,5,2]]}
[null,"Please complete the green colored cells.  The numbers in the blue colored cells will autopopulate."]
[null,"Property Name:"]
[null,"Target Population:",null,null,"   Type of Construction:   "]
[]
[null,"Developer:",null,null,null,null,null,{"$f":"IF(AND(D3=\"Family\",(OR(F3=\"New\",F3=\"New + Rehab\"))),1,IF(AND(D3=\"Senior\",(OR(F3=\"New\",F3=\"New + Rehab\"))),2,IF(AND(D3=\"Family\",(OR(F3<>\"New\",F3<>\"New + Rehab\"))),3,IF(AND(D3=\"Senior\",(OR(F3<>\"New\",F3<>\"New + Rehab\"))),4))))","v":false}]
[null,"County:",null,null,"   Self-Score Total Points:   ",{"$f":"F133","v":0}]
[]
[null,"Note that scoring for Credit Efficiency (up to 7 pts), Development Team Prior Performance (up to 25 pts), and subjective review of Service Enriched and Set-Aside Preference (up to 5 pts) are not included in the self-scoring.  The qualified score will be added to the total proposal score during MHDC's review."]
[]
[]
[]
[]
[]
[null,null,"Phase I - Threshold Documents"]
[]
[null,null,"Executed FIN-100",null,null,"Select"]
[]
[null,null,"Application Fee",null,null,"Select"]
[]
[null,null,"Development Questionnaire",null,null,"Select"]
[]
[null,null,"Market Study",null,null,"Select"]
[]
[null,null,"Financing Letters of Intent",null,null,"Select"]
[]
[null,null,"Notifications"]
[null,null,"Chief Executive of Local Jurisdiction",null,null,"Select"]
[null,null,"State Senator",null,null,"Select"]
[null,null,"State Representative",null,null,"Select"]
[null,null,"Executive Director of Local HFA",null,null,"Select"]
[]
[null,null,"Economic Impact to Missouri (provided in FIN-100)"]
[null,null,"Proposed Services",null,null,"Select"]
[null,null,"Number of employees in Missouri",null,null,"Select"]
[null,null,"Percent of hard and soft costs from MO based firms",null,null,"Select"]
[null,null,"Projected Medicaid Savings (Sr. and Supportive Housing only)",null,null,"Select"]
[]
[null,null,"Pass/Fail",null,null,{"$f":"IF(OR(F16=\"No\",F18=\"No\",F20=\"No\",F24=\"No\",F27=\"No\",F28=\"No\",F29=\"No\",F30=\"No\",F33=\"No\",F34=\"No\",F35=\"No\",F36=\"No\",F16=\"Select\",F18=\"Select\",F20=\"Select\",F24=\"Select\",F27=\"Select\",F28=\"Select\",F29=\"Select\",F30=\"Select\",F33=\"Select\",F34=\"Select\",F35=\"Select\",F36=\"Select\"),\"Fail\",\"Pass\")","v":"Fail"}]
[]
[null,null,"Phase II - Priority Scoring"]
[]
[null,null,"Priority Group"]
[null,null,"Workforce Housing",null,null,"Select"]
[null,null,"Non-Profit (as defined in section III of 2026 QAP)",null,null,"Select"]
[null,null,"Service Enriched, including Veterans Housing",null,null,"Select"]
[null,null,"Permanent Supportive Housing, Vulnerable Populations",null,null,"Select"]
[null,null,"Preservation",null,null,"Select"]
[null,null,"CDBG-DR",null,null,"Select"]
[null,null,"HOME CHDO",null,null,"Select"]
[null,null,"Opportunity Area (as defined in section III of 2026 QAP)",null,null,"Select"]
[null,null,"Opportunity Zone (as enacted under the 2017 Tax Cuts & Jobs Act)",null,null,"Select"]
[]
[null,null,"Phase II Points",null,null,{"$f":"IF(OR(F43=\"Yes\",F44=\"Yes\",F45=\"Yes\",F46=\"Yes\",F47=\"Yes\",F48=\"Yes\",F49=\"Yes\",F50=\"Yes\",F51=\"Yes\"),45,0)","v":0}]
[]
[null,null,"Phase III - General Scoring"]
[]
[null,null,"Development Characteristics "]
[]
[null,null,"Income Targeting (max 13 pts) (no more than 1 category)"]
[null,null,"Location",null,null,"Select"]
[null,null,{"$f":"IF(F60=\"SL/KC\",\">15% of units at 30% AMI (13 pts)\",IF(F60=\"OSM\",\">12.5% of units at 30% AMI (13 pts)\",IF(F60=\"OSR\",\">10% of units at 30% AMI (13 pts)\",\"Select Location Above\")))","v":"Select Location Above"},null,null,0]
[null,null,{"$f":"IF(F60=\"SL/KC\",\">10% of units at 30% AMI (9 pts)\",IF(F60=\"OSM\",\">7.5% of units at 30% AMI (9 pts)\",IF(F60=\"OSR\",\">5% of units at 30% AMI (9 pts)\",\"Select Location Above\")))","v":"Select Location Above"},null,null,0]
[null,null,{"$f":"IF(F60=\"SL/KC\",\">10% of units at 40% AMI (4 pts)\",IF(F60=\"OSM\",\">7.5% of units at 40% AMI (4 pts)\",IF(F60=\"OSR\",\">5% of units at 40% AMI (4 pts)\",\"Select Location Above\")))","v":"Select Location Above"},null,null,0]
[null,{"$f":"MAX(F61:F64)","v":0},{"$f":"IF(F60=\"SL/KC\",\">10% of units at 50% AMI (2 pts)\",IF(F60=\"OSM\",\">7.5% of units at 50% AMI (2) pts)\",IF(F60=\"OSR\",\">5% of units at 50% AMI (2 pts)\",\"Select Location Above\")))","v":"Select Location Above"},null,null,0]
[]
[null,null,"Mixed Income Development (10 pts)",null,null,0]
[]
[null,null,"Homeownership Opportunity (5 pts)",null,null,0]
[]
[null,null,"Housing Priorities (5 pts)"]
[null,null,null,"Select",null,0]
[]
[null,null,"Extended Compliance (up to 5 pts) (no more than 1 category)"]
[null,null,null,"5 - 9 yrs (Total Compliance Period 20-24 yrs)",null,0]
[null,null,"Zoned (10 pts)","10 - 14 yrs (Total Compliance Period 25-29 yrs)",null,0]
[null,{"$f":"MAX(F74:F76)","v":0},"Not Zoned but with Waiver (10 pts)",">=15 yrs (Total Compliance Period 30+ yrs)",null,0]
[]
[null,null,"Previous Phase Success (1 pt)",null,null,0]
[]
[null,null,"Site Location"]
[]
[null,null,"Cost Burdened Households (no more than 1 category)"]
[null,null,"> 20% Cost Burden (10 pts)",null,null,{"$f":"IFERROR(IF((VLOOKUP(D6,'CB and US Counties 2026'!A5:G119,7,FALSE))=10,10,0),0)","v":0}]
[null,null,"> 15% Cost Burden (7 pts)",null,null,{"$f":"IFERROR(IF((VLOOKUP(D6,'CB and US Counties 2026'!A5:G119,7,FALSE))=7,7,0),0)","v":0}]
[null,null,"> 10% Cost Burden (5 pts)",null,null,{"$f":"IFERROR(IF((VLOOKUP(D6,'CB and US Counties 2026'!A5:G119,7,FALSE))=5,5,0),0)","v":0}]
[null,null,"Opportunity Area (7 pts)",null,null,0]
[null,{"$f":"MAX(F83:F85)","v":0},"Rural Underserved County (5 pts)",null,null,{"$f":"IFERROR(VLOOKUP(D6,'CB and US Counties 2026'!A5:H119,8,FALSE),0)","v":0}]
[]
[null,null,"Preservation (up to 15 pts)",null,null,0]
[]
[null,null,"Use of Resources"]
[null,null,"Construction Leverage Funds (min Construction Loan > = 50% TDC) (0,1,3 or 5 pts)",null,null,0]
[]
[null,null,"Leverage Funds "]
[null,null,"> 2.5% (3 pts)",null,null,0]
[null,{"$f":"MAX(F95:F97)","v":0},"> 5% (5 pts)",null,null,0]
[null,{"$f":"IF(B96+F92>10,10,F92+B96)","v":0},"> 7.5% (7 pts)",null,null,0]
[null,null,"CDBG-DR Funds (3 pts)",null,null,0]
[]
[null,null,"Federal Historic Tax Credits (5 pts)",null,null,0]
[]
[null,null,"National Housing Trust Fund (3 pts)",null,null,0]
[]
[null,null,"HOME CHDO - requesting no LIHTC (10 pts)",null,null,0]
[]
[null,null,"Total Development Costs (10 pts for being under limits)",null,null,0]
[]
[null,null,"Rental Assistance (max 5 pts)"]
[null,null,"Developer Funded Rental Assistance Reserve",null,null,0]
[null,{"$f":"MAX(F109:F110)","v":0},"Project-based Vouchers",null,null,0]
[]
[null,null,"Credit Efficiency (-5/0/5 pts)",null,null,0]
[null,null,"Total Credit Efficiency",null,null,{"$f":"IFERROR((F114*F115/E124),0)","v":0}]
[null,null,"Total 4% or 9% Qualified Basis (including acquisition basis)",null,null,0]
[null,null,"Applicable Fraction (must complete)",null,null,0]
[null,null,null,"# Total Units","# LIHTC Units"]
[null,null,"Studio BR",null,null,null,null,{"$f":"IF(AND(H5=1,F113<85000),5,IF(AND(H5=1,F113>90000),-5,IF(AND(H5=1,F113>=85000,F113<=90000),0,0)))","v":0}]
[null,null,"1 Bedroom",null,null,null,null,{"$f":"IF(AND(H5=2,F113<80000),5,IF(AND(H5=2,F113>85000),-5,IF(AND(H5=2,F113>=80000,F113<=85000),0,0)))","v":0}]
[null,null,"2 Bedroom",null,null,null,null,{"$f":"IF(AND(H5=3,F113<65000),5,IF(AND(H5=3,F113>70000),-5,IF(AND(H5=3,F113>=65000,F113<=70000),0,0)))","v":0}]
[null,null,"3 Bedroom",null,null,null,null,{"$f":"IF(AND(H5=4,F113<45000),5,IF(AND(H5=4,F113>50000),-5,IF(AND(H5=4,F113>=45000,F113<=50000),0,0)))","v":0}]
[null,null,"4 Bedroom",null,null,null,null,{"$f":"SUM(H117:H120)","v":0}]
[null,null,"5 Bedroom"]
[null,null,"Totals",{"$f":"SUM(D117:D122)","v":0},{"$f":"SUM(E117:E122)","v":0}]
[null,null,"Total Bedrooms",null,{"$f":"(1*E117)+(1*E118)+(2*E119)+(3*E120)+(4*E121)+(5*E122)","v":0}]
[]
[null,null,"Development Team"]
[]
[null,null,"HOME CHDO (5 pts)",null,null,0]
[null,null,"(as defined in section III of the 2022 QAP)"]
[]
[]
[]
[null,null,"Phase III Objective Points",null,null,{"$f":"F128+F112+F106+F104+F102+F100+F98+B110+B97+F89+F87+F86+B87+F78+F71+F68+F66+B64+B76+F53","v":0}]
[]
[]
[null,null,"Developer comments on items associated with scoring including comments MHDC should consider when scoring prior performance:"]

{"sheet":"MHDC Score","index":2,"n_rows":139,"n_cols":15,"rows_kept":139,"cut":false,"hidden":true,"merged":[[80,13,80,14],[1,3,1,6],[3,3,3,6],[2,6,2,7],[140,1,146,8],[5,1,7,8],[58,2,58,4],[90,2,90,4],[1,1,1,2],[2,1,2,2],[3,1,3,2],[2,4,2,5]]}
[]
[null,"Property Name:",null,{"$f":"'Developer Scoring'!D2:G2","v":0},null,null,null,"Total Points:   ",{"$f":"H51+H136","v":0}]
[null,"Target Population:",null,{"$f":"'Developer Scoring'!D3","v":0},"   Type of Construction:   ",null,{"$f":"'Developer Scoring'!F3:G3","v":0}]
[null,"Developer:",null,{"$f":"'Developer Scoring'!D5:G5","v":0},null,null,null,"County:   ","Andrew"]
[null,null,null,null,null,null,null,null,{"$f":"IF(AND(D3=\"Family\",(OR(G3=\"New\",G3=\"New + Rehab\"))),1,IF(AND(D3=\"Senior\",(OR(G3=\"New\",G3=\"New + Rehab\"))),2,IF(AND(D3=\"Family\",(OR(G3<>\"New\",G3<>\"New + Rehab\"))),3,IF(AND(D3=\"Senior\",(OR(G3<>\"New\",G3<>\"New + Rehab\"))),4))))","v":false}]
[null,"MHDC has NOT included the following categories for self-scoring: Services; Opportunity Area; Economic Development and; Development Team Prior Performance. However, questions about some these categories need completed at the bottom of this spreadsheet."]
[]
[]
[]
[]
[]
[null,null,"Phase I - Threshold Documents",null,null,null,"Developer Points","MHDC Points"]
[]
[null,null,"Executed FIN-100",null,null,null,{"$f":"'Developer Scoring'!F16","v":"Select"},"Select"]
[]
[null,null,"Application Fee",null,null,null,{"$f":"'Developer Scoring'!F18","v":"Select"},"Select"]
[]
[null,null,"Development Questionnaire",null,null,null,{"$f":"'Developer Scoring'!F20","v":"Select"},"Select"]
[]
[null,null,"Market Study",null,null,null,{"$f":"'Developer Scoring'!F22","v":"Select"},"Select"]
[]
[null,null,"Financing Letters of Intent",null,null,null,{"$f":"'Developer Scoring'!F24","v":"Select"},"Select"]
[]
[null,null,"Notifications"]
[null,null,"Chief Executive of Local Jurisdiction",null,null,null,{"$f":"'Developer Scoring'!F27","v":"Select"},"Select"]
[null,null,"State Senator",null,null,null,{"$f":"'Developer Scoring'!F28","v":"Select"},"Select"]
[null,null,"State Representative",null,null,null,{"$f":"'Developer Scoring'!F29","v":"Select"},"Select"]
[null,null,"Executive Director of Local HFA",null,null,null,{"$f":"'Developer Scoring'!F30","v":"Select"},"Select"]
[]
[null,null,"Economic Impact to Missouri (provided in FIN-100)"]
[null,null,"Proposed Services",null,null,null,{"$f":"'Developer Scoring'!F33","v":"Select"},"Select"]
[null,null,"Number of employees in Missouri",null,null,null,{"$f":"'Developer Scoring'!F34","v":"Select"},"Select"]
[null,null,"Percent of hard and soft costs from MO based firms",null,null,null,{"$f":"'Developer Scoring'!F35","v":"Select"},"Select"]
[null,null,"Projected Medicaid Savings (Sr. and Supportive Housing only)",null,null,null,{"$f":"'Developer Scoring'!F36","v":"Select"},"Select"]
[]
[null,null,"Pass/Fail",null,null,null,{"$f":"'Developer Scoring'!F38","v":"Fail"},{"$f":"IF(OR(H14=\"No\",H16=\"No\",H18=\"No\",H22=\"No\",H25=\"No\",H26=\"No\",H27=\"No\",H28=\"No\",H31=\"No\",H32=\"No\",H33=\"No\",H34=\"No\",H14=\"Select\",H16=\"Select\",H18=\"Select\",H22=\"Select\",H25=\"Select\",H26=\"Select\",H27=\"Select\",H28=\"Select\",H31=\"Select\",H32=\"Select\",H33=\"Select\",H34=\"Select\"),\"Fail\",\"Pass\")","v":"Fail"}]
[]
[null,null,"Phase II - Priority Scoring",null,null,null,"Developer Points","MHDC Points"]
[]
[null,null,"Priority Group"]
[null,null,"Workforce Housing",null,null,null,{"$f":"'Developer Scoring'!F43","v":"Select"},"Select",null,null,"Workforce only for counties whose AMI is lower than the State Wide Median Income of $96,000"]
[null,null,"Non-Profit (as defined in section III of 2026 QAP)",null,null,null,{"$f":"'Developer Scoring'!F44","v":"Select"},"Select",null,null,"LIHTC Set-Aside and/or CHDO Set-Aside qualifies"]
[null,null,"Service Enriched including Veterans Housing",null,null,null,{"$f":"'Developer Scoring'!F45","v":"Select"},"Select"]
[null,null,"Permanent Supportive Housing, Vulnerable Populations",null,null,null,{"$f":"'Developer Scoring'!F46","v":"Select"},"Select"]
[null,null,"Preservation",null,null,null,{"$f":"'Developer Scoring'!F47","v":"Select"},"Select",null,null,"Must have Preservation Letter to qualify - always MHDC and then RD or HUD if applicable"]
[null,null,"CDBG-DR",null,null,null,{"$f":"'Developer Scoring'!F48","v":"Select"},"Select"]
[null,null,"HOME CHDO",null,null,null,{"$f":"'Developer Scoring'!F49","v":"Select"},"Select",null,null,"Must be a qualified CHDO - Ask Cristina Dusenbery"]
[null,null,"Opportunity Area (as defined in section III of 2026 QAP)",null,null,null,{"$f":"'Developer Scoring'!F50","v":"Select"},"Select"]
[null,null,"Opportunity Zone (as enacted under the 2017 Tax Cuts & Jobs Act)",null,null,null,{"$f":"'Developer Scoring'!F51","v":"Select"},"Select",null,null,"https://ded.mo.gov/sites/default/files/Opportunity%20Zone%20List_0.pdf"]
[]
[null,null,"Phase II Points",null,null,null,{"$f":"IF(OR(G41=\"Yes\",G42=\"Yes\",G43=\"Yes\",G44=\"Yes\",G45=\"Yes\",G46=\"Yes\",G47=\"Yes\",G48=\"Yes\",G49=\"Yes\"),45,0)","v":0},{"$f":"IF(OR(H41=\"Yes\",H42=\"Yes\",H43=\"Yes\",H44=\"Yes\",H45=\"Yes\",H46=\"Yes\",H47=\"Yes\",H48=\"Yes\",H49=\"Yes\"),45,0)","v":0}]
[]
[null,null,"Phase III - General Scoring",null,null,"Maximum Points","Developer Points","MHDC Points"]
[]
[null,null,"Development Characteristics "]
[]
[null,null,"Income Targeting (no more than 1 category)",null,null,null,null,null,null,null,"Income Averaging = unavailable points"]
[null,null,"Location",null,null,null,{"$f":"'Developer Scoring'!F60","v":"Select"},{"$f":"IFERROR(VLOOKUP(I4,'County Table'!A2:B117,2,FALSE),\"\")","v":"OSR"},null,null,"The % per location will populate after the county is completed at top of spreadsheet"]
[null,null,{"$f":"IFERROR(IF(OR(H58=\"STL\",H58=\"KC\"),\">15% of units at 30% AMI (13 pts)\",IF(H58=\"OSM\",\">12.5% of units at 30% AMI (13 pts)\",IF(H58=\"OSR\",\">10% of units at 30% AMI (13 pts)\",\"Select County at Top\"))),\"Select County at Top\")","v":">10% of units at 30% AMI (13 pts)"},null,null,13,{"$f":"'Developer Scoring'!F61","v":0},0]
[null,null,{"$f":"IFERROR(IF(OR(H58=\"STL\",H58=\"KC\"),\">10% of units at 30% AMI (9 pts)\",IF(H58=\"OSM\",\">7.5% of units at 30% AMI (9 pts)\",IF(H58=\"OSR\",\">5% of units at 30% AMI (9 pts)\",\"Select County at Top\"))),\"Select County at Top\")","v":">5% of units at 30% AMI (9 pts)"},null,null,9,{"$f":"'Developer Scoring'!F62","v":0},0]
[null,null,{"$f":"IFERROR(IF(OR(H58=\"STL\",H58=\"KC\"),\">10% of units at 40% AMI (4 pts)\",IF(H58=\"OSM\",\">7.5% of units at 40% AMI (4 pts)\",IF(H58=\"OSR\",\">5% of units at 40% AMI (4 pts)\",\"Select County at Top\"))),\"Select County at Top\")","v":">5% of units at 40% AMI (4 pts)"},null,null,4,{"$f":"'Developer Scoring'!F63","v":0},0]
[null,{"$f":"MAX(H59:H62)","v":0},{"$f":"IFERROR(IF(OR(H58=\"STL\",H58=\"KC\"),\">10% of units at 50% AMI (2 pts)\",IF(H58=\"OSM\",\">7.5% of units at 50% AMI (2 pts)\",IF(H58=\"OSR\",\">5% of units at 50% AMI (2 pts)\",\"Select County at Top\"))),\"Select County at Top\")","v":">5% of units at 50% AMI (2 pts)"},null,null,2,{"$f":"'Developer Scoring'!F64","v":0},0]
[]
[null,null,"Mixed Income Development",null,null,10,{"$f":"'Developer Scoring'!F66","v":0},0,null,null,"Must have at least 10% market or Income Averaging units at 80% AMI."]
[]
[null,null,"Homeownership",null,null,5,{"$f":"'Developer Scoring'!F68","v":0},0,null,null,"Single Family or Duplex ONLY - developments intended for 100% eventual tenant ownership.  Must include tenant ownership plan."]
[]
[null,null,"Housing Priorities (no more than 1 category)"]
[null,{"$f":"H69+B70","v":0},null,"Priority Selection",{"$f":"'Developer Scoring'!D71","v":"Select"},5,{"$f":"'Developer Scoring'!F71","v":0},0,null,null,"At least 15% of total units must be set-aside"]
[null,{"$f":"MAX(H70:H71)","v":0},null,"Service Enriched Subjective Score",null,5,null,0]
[null,null,null,"Set-Aside Preference Subjective Score",null,5,null,0]
[]
[null,null,"Extended Compliance (no more than 1 category)",null,null,null,null,null,null,null,"This must be noted in the FIN-100 on the Tax Credit Addendum tab within the \"Opt-Out\" question"]
[null,null,null,"5 - 9 yrs (Total Compliance Period 20-24 yrs)",null,1,{"$f":"'Developer Scoring'!F74","v":0},0]
[null,null,"Zoned (10 pts)","10 - 14 yrs (Total Compliance Period 25-29 yrs)",null,3,{"$f":"'Developer Scoring'!F75","v":0},0]
[null,{"$f":"MAX(H74:H76)","v":0},"Not Zoned but with Waiver (10 pts)",">=15 yrs (Total Compliance Period 30+ yrs)",null,5,{"$f":"'Developer Scoring'!F76","v":0},0]
[]
[null,null,"Previous Phase Success",null,null,1,{"$f":"'Developer Scoring'!F78","v":0},0,null,null,"Any previous phase - must have vacancy rate <5%, waitlist and be within 1/2 mile of 1st phase.  (Information of form 1300 of market study.)"]
[]
[null,null,"Site Location"]
[null,null,"Cost Burdened Households (no more than 1 category)",null,null,null,null,null,null,null,"See Rent Burdened spreadsheet",null,null,"Underserved Counties (2026)"]
[null,null,"> 20% Cost Burden",null,null,10,{"$f":"'Developer Scoring'!F83","v":0},{"$f":"IFERROR(IF((VLOOKUP($I$4,'CB and US Counties 2026'!A5:G119,7,FALSE))=10,10,0),0)","v":0},null,null,null,null,null,"Cedar","Lafayette"]
[null,null,"> 15% Cost Burden",null,null,7,{"$f":"'Developer Scoring'!F84","v":0},{"$f":"IFERROR(IF((VLOOKUP(I4,'CB and US Counties 2026'!A5:G119,7,FALSE))=7,7,0),0)","v":0},null,null,null,null,null,"Dent","Mississippi"]
[null,null,"> 10% Cost Burden",null,null,5,{"$f":"'Developer Scoring'!F85","v":0},{"$f":"IFERROR(IF((VLOOKUP(I4,'CB and US Counties 2026'!A5:G119,7,FALSE))=5,5,0),0)","v":0},null,null,null,null,null,"Hickory","New Madrid"]
[null,{"$f":"MAX(H82:H84)","v":0},"Rural Underserved County",null,null,5,{"$f":"'Developer Scoring'!F87","v":0},{"$f":"IFERROR(VLOOKUP(I4,'CB and US Counties 2026'!A5:H119,8,FALSE),0)","v":0},null,null,null,null,null,"Howard","Pemiscot"]
[null,null,null,"Opportunity Area",null,7,{"$f":"'Developer Scoring'!F86","v":0},0,null,null,null,null,null,"Iron","Wright"]
[]
[null,null,"Preservation",null,null,15,{"$f":"'Developer Scoring'!F89","v":0},0,null,null,"Must have preservation letter to qualify - MHDC/RD/HUD as applicable."]
[]
[null,null,"Use of Resources"]
[null,null,"Construction Leverage Funds (min Construction Loan > = 50% TDC)            (0,1,3 or 5 pts)",null,null,null,{"$f":"'Developer Scoring'!F92","v":0},0,null,null,"MHDC resource, private bank loans and affiliated part grant funds are not eligible for points in this category."]
[null,null,"Leveraged Funds"]
[null,null,"> 2.5%",null,null,3,{"$f":"'Developer Scoring'!F95","v":0},0,null,null,"MHDC resource, private bank loans and affiliated part grant funds are not eligible for points in this category."]
[null,{"$f":"MAX(H93:H95)","v":0},"> 5%",null,null,5,{"$f":"'Developer Scoring'!F96","v":0},0]
[null,{"$f":"IF(B94+H91>7,7,H91+B94)","v":0},"> 7.5%",null,null,7,{"$f":"'Developer Scoring'!F97","v":0},0]
[null,null,null,"CDBG-DR Funds",null,3,{"$f":"'Developer Scoring'!F98","v":0},0]
[]
[null,null,"Federal Historic Tax Credits",null,null,5,{"$f":"'Developer Scoring'!F100","v":0},0,null,null,"To qualify, development must be utilizing Federal Historic Tax Credits"]
[]
[null,null,"National Housing Trust Fund ",null,null,null,{"$f":"'Developer Scoring'!F102","v":0},0]
[]
[null,null,"HOME CHDO - requesting no LIHTC (10 pts)",null,null,null,{"$f":"'Developer Scoring'!F104","v":0},0,null,null,"Only qualify if development is HOME/CHDO only - no tax credits"]
[]
[null,null,"Total Development Costs (10 pts for being under limits)",null,null,null,{"$f":"'Developer Scoring'!F106","v":0},0]
[]
[null,null,"Rental Assistance"]
[null,null,null,"Developer Funded Rental Assistance Reserve",null,2,{"$f":"'Developer Scoring'!F109","v":0},0,null,null,"Must have 15% units with rental assistance commitment letter."]
[null,{"$f":"MAX(H107:H108)","v":0},">= 10 year commitment (5 pts)","Project-based Vouchers",null,5,{"$f":"'Developer Scoring'!F110","v":0},0]
[]
[null,null,"Credit Efficiency ",null,null,null,"N/A",0]
[null,null,"Total Credit Efficiency",null,null,null,{"$f":"'Developer Scoring'!F113","v":0},{"$f":"IFERROR((H112/M122*H113),0)","v":0}]
[null,null,"Total 4% or 9% Qualified Basis (including acquisition basis)",null,null,null,{"$f":"'Developer Scoring'!F114","v":0},0]
[null,null,"Credit Efficiency (up to 7 pts)",null,null,7,null,0,null,null,"Per Julie"]
[]
[]
[null,null,null,null,null,null,null,null,{"$f":"IF(AND(I5=1,H111<85000),5,IF(AND(I5=1,H111>90000),-5,IF(AND(I5=1,H111>=85000,H111<=90000),0,0)))","v":0}]
[null,null,null,null,null,null,null,null,{"$f":"IF(AND(I5=2,H111<80000),5,IF(AND(I5=2,H111>85000),-5,IF(AND(I5=2,H111>=80000,H111<=85000),0,0)))","v":0}]
[null,null,null,null,null,null,null,null,{"$f":"IF(AND(I5=3,H111<65000),5,IF(AND(I5=3,H111>70000),-5,IF(AND(I5=3,H111>=65000,H111<=70000),0,0)))","v":0}]
[null,null,null,null,null,null,null,null,{"$f":"IF(AND(I5=4,H111<45000),5,IF(AND(I5=4,H111>50000),-5,IF(AND(I5=4,H111>=45000,H111<=50000),0,0)))","v":0}]
[null,null,null,null,null,null,null,null,{"$f":"SUM(I116:I119)","v":0}]
[]
[]
[]
[null,null,"Development Team"]
[]
[null,null,"Non-Profit and HOME CHDO (5 pts)",null,null,null,{"$f":"'Developer Scoring'!F128","v":0},0,null,null,"LIHTC Set-Aside and/or CHDO Set-Aside qualifies (No 4% Applications)"]
[]
[null,null,"Credit Efficiency ",null,null,null,"N/A",0]
[null,null,"Total Credit Efficiency",null,null,null,{"$f":"'Developer Scoring'!F131","v":0},{"$f":"IFERROR((H130/#REF!*H132),0)","v":0}]
[null,null,"Total 4% or 9% Qualified Basis (including acquisition basis)",null,null,null,{"$f":"'Developer Scoring'!F132","v":0},0]
[null,null,"Development Team"]
[null,null,"Development Team Prior Performance (25 pts)",null,null,25,null,0,null,null,"Per Julie"]
[null,null,"(as defined in section III of the 2025 QAP)"]
[]
[]
[null,null,"Phase III Total Points",null,null,null,{"$f":"'Developer Scoring'!F133","v":0},{"$f":"IFERROR((H126+H113+H104+H102+H100+H98+B108+B95+B76+H96+B69+H86+H88+B85+H78+H66+H64+B62+H51+H85+H132),0)","v":0}]
[]
[]
[null,"MHDC Scoring Comments:"]

{"sheet":"CB and US Counties 2026","index":3,"n_rows":141,"n_cols":8,"rows_kept":141,"cut":false,"hidden":true,"merged":[[0,0,0,26],[1,0,1,26]]}
["Severe Cost Burdened Renter Households"]
["(For use with 2025 QAP)"]
[]
["County","Total Households","Renter Households","Renter Households w/ 50% or more CB","% of All Households","Severe Cost Burden % of All Renter Households"]
["Adair",4010,665,225,5.6109725685785539E-2,0.20364741641337386,10,0]
["Andrew",4300,1160,330,7.6744186046511634E-2,6.6445182724252497E-2,0,0]
["Atchison",6640,3095,880,0.13253012048192772,9.6503496503496503E-2,0,0]
["Audrain",8060,1365,355,4.4044665012406947E-2,0.14258188824662812,5,0]
["Barry",4425,770,195,4.4067796610169491E-2,0.16533333333333333,7,0]
["Barton",71920,31630,7910,0.10998331479421579,0.19169811320754718,7,0]
["Bates",143565,80230,19040,0.13262285375962107,0.15789473684210525,7,0]
["Benton",127530,55785,12985,0.10181917980083117,0.27083333333333331,10,0]
["Bollinger",4830,1510,345,7.1428571428571425E-2,0.22047244094488189,10,0]
["Boone",4850,1430,320,6.5979381443298971E-2,0.25947712418300656,10,0]
["Buchanan",30215,10300,2260,7.4797286116167469E-2,0.20865345733926405,10,0]
["Butler",19820,3900,845,4.2633703329969727E-2,0.15314494074749316,7,0]
["Caldwell",4975,980,210,4.2211055276381908E-2,0.10993377483443709,5,0]
["Callaway",18215,7320,1565,8.5918199286302496E-2,0.12597402597402596,5,0]
["Camden",9080,3490,745,8.2048458149779735E-2,0.14275741710296685,5,0]
["Cape Girardeau",13130,2690,569,4.3335872048743333E-2,0.23239074550128536,10,0]
["Carroll",291530,121135,25250,8.6612012485850515E-2,7.5144508670520235E-2,0,0]
["Carter",33640,12760,2635,7.8329369797859691E-2,8.9090909090909096E-2,0,0]
["Cass",409660,129945,26760,6.5322462529902842E-2,0.14687819856704196,5,0]
["Cedar",1700,360,74,4.3529411764705879E-2,0.17785234899328858,7,5]
["Chariton",8295,2165,435,5.2441229656419529E-2,9.0909090909090912E-2,0,0]
["Christian",3360,1050,209,6.2202380952380953E-2,0.14828897338403041,5,0]
["Clark",12120,4645,920,7.590759075907591E-2,0.14107142857142857,5,0]
["Clay",8510,3565,705,8.2843713278495892E-2,0.16904724533040338,7,0]
["Clinton",6340,1630,320,5.0473186119873815E-2,0.12348284960422164,5,0]
["Cole",15555,4945,955,6.1395049823207974E-2,0.11168562564632885,5,0]
["Cooper",4130,600,115,2.784503631961259E-2,0.17567567567567569,7,0]
["Crawford",46460,16905,3185,6.8553594489883768E-2,0.17665369649805449,7,0]
["Dade",9800,2660,499,5.0918367346938775E-2,4.9295774647887321E-2,0,0]
["Dallas",5000,1970,369,7.3800000000000004E-2,0.14032786885245901,5,0]
["Daviess",15340,5185,960,6.2581486310299875E-2,0.1040650406504065,5,0]
["Dekalb",13870,3595,660,4.7584715212689255E-2,0.15185185185185185,7,0]
["Dent",6975,1690,305,4.3727598566308243E-2,0.15615615615615616,7,5]
["Douglas",5440,1370,240,4.4117647058823532E-2,0.10714285714285714,5,0]
["Dunklin",7280,2740,480,6.5934065934065936E-2,0.18054862842892769,7,0]
["Franklin",8765,1945,340,3.8790644609241302E-2,0.16805399325084364,7,0]
["Gasconade",9850,2345,408,4.1421319796954313E-2,6.4377682403433473E-2,0,0]
["Gentry",16195,5000,865,5.3411546773695584E-2,6.6019417475728162E-2,0,0]
["Greene",8870,2570,444,5.0056369785794814E-2,0.22966336280025001,10,0]
["Grundy",11835,3675,630,5.3231939163498096E-2,0.12612612612612611,5,0]
["Harrison",24570,7880,1345,5.4741554741554739E-2,0.1744186046511628,7,0]
["Henry",12710,3700,625,4.9173878835562547E-2,0.15584905660377357,7,0]
["Hickory",3460,705,119,3.4393063583815026E-2,0.4,10,5]
["Holt",1685,360,60,3.5608308605341248E-2,6.1538461538461542E-2,0,0]
["Howard",41125,9360,1539,3.7422492401215805E-2,0.17647058823529413,7,5]
["Howell",92515,29270,4805,5.1937523644814354E-2,0.18637274549098196,7,0]
["Iron",149470,27570,4460,2.9838763631497959E-2,0.18181818181818182,7,5]
["Jackson",6355,1810,290,4.5633359559402044E-2,0.21504319698644719,10,0]
["Jasper",19930,7490,1200,6.0210737581535376E-2,0.19527145359019266,7,0]
["Jefferson",17300,3205,510,2.9479768786127167E-2,0.14156976744186048,5,0]
["Johnson",6410,1575,250,3.9001560062402497E-2,0.14734774066797643,5,0]
["Knox",5315,925,145,2.7281279397930385E-2,0.1,5,0]
["Laclede",22390,7720,1209,5.3997320232246536E-2,0.11072664359861592,5,0]
["Lafayette",40395,9920,1545,3.8247307835128107E-2,0.17647058823529413,7,5]
["Lawrence",9280,2185,339,3.6530172413793104E-2,0.12237762237762238,5,0]
["Lewis",9350,2755,425,4.5454545454545456E-2,0.16855345911949685,7,0]
["Lincoln",3810,1010,154,4.0419947506561679E-2,0.23049645390070922,10,0]
["Linn",11545,3460,524,4.5387613685578171E-2,0.16355140186915887,7,0]
["Livingston",7250,1385,209,2.8827586206896551E-2,9.1176470588235289E-2,0,0]
["Macon",3800,1155,174,4.5789473684210526E-2,0.13879003558718861,5,0]
["Madison",6565,1965,295,4.4935262757044937E-2,0.19915254237288135,7,0]
["Maries",5575,1675,250,4.4843049327354258E-2,0.17282608695652174,7,0]
["Marion",7640,1435,214,2.8010471204188481E-2,0.15505913272010513,7,0]
["Mcdonald",16360,5905,890,5.4400977995110025E-2,0.1,5,0]
["Mercer",15060,7185,1070,7.1049136786188585E-2,0.10638297872340426,5,0]
["Miller",9285,2680,398,4.2864835756596664E-2,9.2929292929292931E-2,0,0]
["Mississippi",32485,8215,1205,3.7094043404648301E-2,0.15168539325842698,7,5]
["Moniteau",4100,1100,160,3.9024390243902439E-2,0.15234375,7,0]
["Monroe",84980,17395,2525,2.9712873617321722E-2,9.6590909090909088E-2,0,0]
["Montgomery",11535,4070,590,5.1148677936714348E-2,8.7301587301587297E-2,0,0]
["Morgan",22125,6125,875,3.954802259887006E-2,0.19855595667870035,7,0]
["New Madrid",12690,2120,300,2.3640661938534278E-2,0.16596638655462184,7,5]
["Newton",39920,13110,1780,4.458917835671343E-2,0.14864864864864866,5,0]
["Nodaway",2635,630,85,3.2258064516129031E-2,0.20724637681159419,10,0]
["Oregon",5000,1205,159,3.1800000000000002E-2,0.23036649214659685,10,0]
["Osage",14415,4620,609,4.2247658688865763E-2,0.15449101796407186,7,0]
["Ozark",6655,1900,250,3.7565740045078885E-2,8.6486486486486491E-2,0,0]
["Pemiscot",5905,1965,255,4.3183742591024553E-2,0.25871559633027524,10,5]
["Perry",3705,885,114,3.0769230769230771E-2,9.2592592592592587E-2,0,0]
["Pettis",810,150,19,2.3456790123456792E-2,0.16465942744323792,7,0]
["Phelps",14850,4265,525,3.5353535353535352E-2,0.20014295925661185,10,0]
["Pike",1335,285,35,2.6217228464419477E-2,0.15642458100558659,7,0]
["Platte",5910,1515,185,3.1302876480541454E-2,0.14356611130804678,5,0]
["Polk",2725,620,74,2.7155963302752294E-2,0.17113095238095238,7,0]
["Pulaski",2580,465,55,2.1317829457364341E-2,0.14667580534612748,5,0]
["Putnam",5450,1280,149,2.7339449541284404E-2,0.203125,10,0]
["Ralls",13695,2985,345,2.5191675794085433E-2,0.1388888888888889,5,0]
["Randolph",30290,9960,1150,3.7966325519973587E-2,0.15341959334565619,7,0]
["Ray",3000,600,68,2.2666666666666668E-2,0.16797900262467191,7,0]
["Reynolds",5275,855,94,1.7819905213270142E-2,0.18823529411764706,7,0]
["Ripley",3900,1280,140,3.5897435897435895E-2,0.21935483870967742,10,0]
["Saline",16235,4130,400,2.4638127502309825E-2,8.7981859410430838E-2,0,0]
["Schuyler",2010,470,45,2.2388059701492536E-2,9.8305084745762716E-2,0,0]
["Scotland",8235,2405,225,2.7322404371584699E-2,0.15151515151515152,7,0]
["Scott",8395,2680,250,2.9779630732578916E-2,0.18606965174129353,7,0]
["Shannon",6800,1460,135,1.9852941176470587E-2,7.8260869565217397E-2,0,0]
["Shelby",1440,440,40,2.7777777777777776E-2,4.9152542372881358E-2,0,0]
["St Charles",8100,1795,195,2.4074074074074074E-2,0.1554054054054054,7,0]
["St Clair",2550,785,85,3.3333333333333333E-2,0.1125748502994012,5,0]
["St Francois",4995,1365,140,2.8028028028028028E-2,0.14814814814814814,5,0]
["St Louis",3730,930,95,2.5469168900804289E-2,0.21461027612722824,10,0]
["St Louis city",2220,585,25,1.1261261261261261E-2,0.23997180571575036,10,0]
["Ste Genevieve",3595,845,89,2.4756606397774689E-2,0.1672566371681416,7,0]
["Stoddard",1400,210,19,1.3571428571428571E-2,0.15889212827988339,7,0]
["Stone",3065,770,65,2.1207177814029365E-2,0.16010498687664043,7,0]
["Sullivan",4120,805,64,1.5533980582524271E-2,0.05,0,0]
["Taney",7575,2000,150,1.9801980198019802E-2,0.18100803506208912,7,0]
["Texas",2495,600,44,1.7635270541082163E-2,0.14976525821596245,5,0]
["Vernon",4080,840,59,1.4460784313725491E-2,0.17005076142131981,7,0]
["Warren",10450,2770,190,1.8181818181818181E-2,0.19108280254777071,7,0]
["Washington",3030,790,54,1.782178217821782E-2,0.16963350785340314,7,0]
["Wayne",3520,970,65,1.8465909090909092E-2,0.13043478260869565,5,0]
["Webster",6155,1285,85,1.380991064175467E-2,7.9931972789115652E-2,0,0]
["Worth",2335,660,40,1.7130620985010708E-2,7.407407407407407E-2,0,0]
["Wright",2485,605,29,1.1670020120724347E-2,0.15960912052117263,7,5]
[null,null,null,null,null,null,null,{"$f":"SUM(H5:H119)","v":50}]
[]
[]
[]
[]
[]
[]
[]
[]
[]
[]
[]
[]
[]
[]
[]
[]
[]
[]
[null,null,null,null,null,"Select"]
[null,null,null,null,null,"Service Enriched"]
[null,null,null,null,null,"PSH/Vulnerable Populations"]

{"sheet":"CB and US Counties","index":4,"n_rows":120,"n_cols":16,"rows_kept":120,"cut":false,"hidden":true,"merged":[[0,0,0,26],[1,0,1,26]]}
["Severe Cost Burdened Renter Households"]
["(For use with 2023 QAP)"]
[]
["County","Total Households","Renter Households","Renter Households w/ 50% or more CB","% of All Households","Severe Cost Burden % of All Renter Households"]
["Adair",4012,664,224,0.33734939759036142,0.27363184079601988,10,0,null,null,null,null,null,null,null,1]
["Boone",6640,3095,878,0.2836833602584814,0.26538474202364098,10,0,null,null,null,null,null,null,null,1]
["Randolph",4298,1161,329,0.2833763996554694,0.25518672199170123,10,0,null,null,null,null,null,null,null,1]
["St. Louis City",4830,1512,408,0.26984126984126983,0.25285502290470352,10,0,null,null,null,null,null,null,null,1]
["Warren",8060,1363,351,0.2575201760821717,0.25009345794392523,10,0]
["Lincoln",71919,31631,8073,0.25522430527014639,0.24512195121951219,10,0,null,null,null,null,null,null,null,1]
["Phelps",4426,769,194,0.25227568270481143,0.23710601719197708,10,0,null,null,null,null,null,null,null,1]
["Ralls",143566,80228,19673,0.24521364112280003,0.23664122137404581,10,5,null,null,null,null,null,null,null,1]
["Texas",127532,55786,13350,0.23930735309934392,0.23106796116504855,10,0,null,null,null,null,null,null,null,1]
["Benton",4851,1432,324,0.22625698324022347,0.22657342657342658,10,0,null,null,null,null,null,null,null,1]
["Greene",9078,3489,785,0.22499283462310118,0.22629998122770789,10,0,null,null,null,null,null,null,null,1]
["Oregon",30215,10299,2262,0.21963297407515292,0.22535211267605634,10,0]
["Morgan",18213,7322,1592,0.21742693253209505,0.22302158273381295,10,0]
["Cape Girardeau",19818,3898,846,0.21703437660338634,0.22067932067932067,10,0]
["Madison",4973,978,212,0.21676891615541921,0.21708185053380782,10,0]
["Vernon",33642,12760,2749,0.21543887147335422,0.21601731601731602,10,0]
["Dunklin",291532,121133,26007,0.21469789405034137,0.21530054644808744,10,0]
["St. Louis",409658,129943,27736,0.21344743464442101,0.21469793615014468,10,0]
["Mississippi",8294,2165,461,0.21293302540415704,0.21336760925449871,10,0]
["Dent",13129,2689,569,0.21160282632949051,0.21165644171779141,10,5]
["Scott",1698,361,75,0.2077562326869806,0.20766129032258066,10,0]
["Hickory",15557,4943,1012,0.20473396722638074,0.20751879699248121,10,5]
["Jackson",8510,3567,724,0.20297168488926268,0.20477669303227355,10,0]
["Howell",3361,1050,213,0.20285714285714285,0.19830148619957538,7,0]
["Pemiscot",12119,4647,931,0.20034430815579943,0.19798657718120805,7,0]
["Barry",15342,5185,1029,0.19845708775313403,0.1963276836158192,7,0]
["Buchanan",3460,706,140,0.19830028328611898,0.19603078169299312,7,0]
["Nodaway",6342,1630,320,0.19631901840490798,0.19527834450597492,7,0]
["Crawford",46461,16903,3275,0.19375258829793529,0.19101123595505617,7,0]
["Ste. Genevieve",7281,2741,529,0.19299525720539948,0.1906474820143885,7,0]
["Maries",6977,1691,324,0.19160260201064458,0.18941798941798943,7,0]
["Johnson",9852,2347,449,0.19130805283340435,0.18883841661258924,7,0]
["Dallas",9798,2661,509,0.19128147313040211,0.18771331058020477,7,0]
["St. Francois",4998,1970,367,0.18629441624365481,0.1874116891457932,7,0]
["Jasper",4132,602,112,0.18604651162790697,0.18510573092246399,7,0]
["Bollinger",13872,3597,668,0.18571031415068112,0.18497109826589594,7,0]
["Pettis",16193,5000,895,0.17899999999999999,0.18290946083418108,7,0]
["DeKalb",8872,2568,457,0.1779595015576324,0.18274978650725876,7,0]
["Putnam",24572,7882,1402,0.17787363613296117,0.18157894736842106,7,0]
["Ray",22390,7721,1360,0.17614298665975911,0.18095739084692267,7,0]
["Lafayette",12711,3698,648,0.1752298539751217,0.17748344370860927,7,0]
["Washington",8766,1945,340,0.17480719794344474,0.17681940700808627,7,0]
["Stoddard",5438,1370,237,0.17299270072992701,0.1767467550400442,7,0]
["Taney",11833,3675,634,0.17251700680272108,0.17643540669856458,7,0]
["Butler",19931,7492,1282,0.17111585691404163,0.17600700525394045,7,0]
["Wright",41127,9362,1553,0.16588335825678274,0.17544757033248082,7,5]
["Cass",92514,29268,4854,0.16584665846658467,0.17512064343163539,7,0]
["Iron",17300,3207,528,0.1646398503274088,0.17446808510638298,7,5]
["Wayne",149472,27568,4521,0.16399448636099825,0.17391304347826086,7,0]
["New Madrid",6355,1810,295,0.16298342541436464,0.17293804637020144,7,5]
["Jefferson",1687,360,58,0.16111111111111112,0.17261556465769456,7,0]
["Chariton",40397,9921,1590,0.16026610220743875,0.1721170395869191,7,0]
["Ozark",6565,1963,314,0.1599592460519613,0.17197452229299362,7,0]
["Polk",6412,1576,252,0.15989847715736041,0.17194950911640955,7,0]
["Ripley",9284,2680,426,0.15895522388059702,0.16901408450704225,7,0]
["Pulaski",9278,2186,342,0.15645013723696249,0.16818361693707953,7,0]
["Cedar",5317,925,143,0.1545945945945946,0.16814159292035399,7,5]
["Camden",11545,3461,535,0.15457960127130888,0.16557377049180327,7,0]
["Clay",9349,2754,425,0.15432098765432098,0.16349541930937281,7,0]
["St. Charles",16358,5904,897,0.15193089430894308,0.1604297224709042,7,0]
["Barton",7252,1384,210,0.15173410404624277,0.1588850174216028,7,0]
["Christian",3800,1155,175,0.15151515151515152,0.15849056603773584,7,0]
["Franklin",3808,1012,153,0.15118577075098813,0.15566265060240964,7,0]
["Douglas",12689,2118,318,0.1501416430594901,0.15196078431372548,7,0]
["Henry",15061,7184,1077,0.14991648106904232,0.15127701375245581,7,0]
["Livingston",11537,4070,610,0.14987714987714987,0.15104166666666666,7,0]
["Marion",5573,1674,250,0.14934289127837516,0.15104166666666666,7,0]
["Worth",32487,8215,1224,0.14899573950091297,0.14925373134328357,5,0]
["Platte",7639,1437,214,0.14892136395267919,0.145522949586155,5,0]
["Carter",84978,17393,2590,0.14891048122808026,0.14203454894433781,5,0]
["Scotland",4102,1101,162,0.14713896457765668,0.13924050632911392,5,0]
["Caldwell",39918,13110,1895,0.14454614797864226,0.13837209302325582,5,0]
["Newton",22123,6125,882,0.14399999999999999,0.13768924302788846,5,0]
["Lawrence",6653,1900,263,0.13842105263157894,0.13763702801461633,5,0]
["Linn",5002,1207,165,0.13670256835128416,0.13745454545454547,5,0]
["Montgomery",2723,619,83,0.13408723747980614,0.13655172413793104,5,0]
["Daviess",2633,630,84,0.13333333333333333,0.13636363636363635,5,5]
["Laclede",14413,4618,609,0.13187527067994803,0.13364595545134819,5,0]
["Webster",3002,600,79,0.13166666666666665,0.13263785394932937,5,0]
["Stone",5907,1967,258,0.13116420945602442,0.13203463203463203,5,0]
["Bates",13697,2984,383,0.12835120643431636,0.13183098591549297,5,0]
["Cole",3597,846,106,0.12529550827423167,0.1307498741821842,5,0]
["Callaway",14849,4263,526,0.12338728594886231,0.12974238875878219,5,0]
["Cooper",5908,1517,187,0.12326961107448912,0.12910662824207492,5,0]
["Moniteau",3703,886,108,0.12189616252821671,0.12510154346060115,5,0]
["Clinton",30291,9960,1200,0.12048192771084337,0.12447916666666667,5,0]
["Audrain",5450,1279,152,0.11884284597341674,0.12139130434782609,5,0]
["Saline",1333,284,33,0.11619718309859155,0.12080808080808081,5,0]
["Pike",808,149,17,0.11409395973154363,0.12010723860589813,5,0]
["Reynolds",2580,464,52,0.11206896551724138,0.11796733212341198,5,0]
["Lewis",3900,1278,141,0.11032863849765258,0.11578947368421053,5,0]
["Dade",8100,1795,196,0.10919220055710306,0.11532846715328467,5,0]
["Grundy",5273,853,93,0.10902696365767878,0.11235955056179775,5,0]
["St. Clair",2549,787,83,0.10546378653113088,0.11235955056179775,5,0]
["Macon",1440,440,45,0.10227272727272728,0.11225188227241616,5,0]
["Atchison",16233,4129,419,0.10147735529183821,0.1111111111111111,5,0]
["Perry",4995,1365,138,0.1010989010989011,0.11051212938005391,5,0]
["Miller",1400,210,21,0.1,0.11042231693142193,5,0]
["Clark",6799,1459,144,9.8697738176833444E-2,0.1076923076923077,5,0]
["Shannon",3731,929,91,9.7954790096878366E-2,0.10596026490066225,5,0]
["Monroe",2010,471,45,9.5541401273885357E-2,0.10329670329670329,5,0]
["Schuyler",8235,2406,227,9.4347464671654196E-2,0.10321100917431193,5,0]
["Andrew",8393,2678,248,9.2606422703510077E-2,9.8859315589353611E-2,0,5]
["Knox",4120,806,66,8.1885856079404462E-2,9.765625E-2,0,0]
["Holt",3063,770,62,8.0519480519480519E-2,9.4537815126050417E-2,0,0]
["Osage",7577,2002,158,7.8921078921078927E-2,9.2105263157894732E-2,0,0]
["McDonald",4082,839,65,7.7473182359952319E-2,8.9376715013720104E-2,0,5]
["Harrison",3028,789,59,7.477820025348543E-2,8.6486486486486491E-2,0,0]
["Gasconade",2495,598,44,7.3578595317725759E-2,8.461538461538462E-2,0,0]
["Carroll",10452,2771,192,6.9289065319379284E-2,8.3333333333333329E-2,0,0]
["Mercer",6154,1283,85,6.6250974279033509E-2,7.6923076923076927E-2,0,0]
["Howard",3518,968,63,6.5082644628099179E-2,6.5306122448979598E-2,0,0]
["Sullivan",2334,659,40,6.0698027314112293E-2,5.545286506469501E-2,0,0]
["Gentry",2485,605,36,5.9504132231404959E-2,5.3030303030303032E-2,0,0]
["Shelby",2218,583,26,4.4596912521440824E-2,4.7543581616481777E-2,0,0]
[null,null,null,null,null,null,null,{"$f":"SUM(H5:H119)","v":50}]

{"sheet":"County Table","index":5,"n_rows":117,"n_cols":5,"rows_kept":117,"cut":false,"hidden":true,"merged":[]}
["County","Region","County","PH Zone City","PH Zone #"]
["Adair","OSR","Adair","Columbia",2]
["Andrew","OSR","Andrew","Kansas City",1]
["Atchison","OSR","Atchison","Kansas City",1]
["Audrain","OSR","Audrain","Columbia",2]
["Barry","OSR","Barry","Springfield",4]
["Barton","OSR","Barton","Springfield",4]
["Bates","OSR","Bates","Kansas City",1]
["Benton","OSR","Benton","Columbia",2]
["Bollinger","OSM","Bollinger","St. Louis",3]
["Boone","OSM","Boone","Columbia",2]
["Buchanan","OSR","Buchanan","Kansas City",1]
["Butler","OSR","Butler","St. Louis",3]
["Caldwell","OSR","Caldwell","Kansas City",1]
["Callaway","OSM","Callaway","Columbia",2]
["Camden","OSR","Camden","Columbia",2]
["Cape Girardeau","OSM","Cape Girardeau","St. Louis",3]
["Carroll","OSR","Carroll","Kansas City",1]
["Carter","OSR","Carter","St. Louis",3]
["Cass","KC","Cass","Kansas City",1]
["Cedar","OSR","Cedar","Springfield",4]
["Chariton","OSR","Chariton","Columbia",2]
["Christian","OSR","Christian","Springfield",4]
["Clark","OSR","Clark","Columbia",2]
["Clay","KC","Clay","Kansas City",1]
["Clinton","OSR","Clinton","Kansas City",1]
["Cole","OSM","Cole","Columbia",2]
["Cooper","OSM","Cooper","Columbia",2]
["Crawford","OSR","Crawford","St. Louis",3]
["Dade","OSR","Dade","Springfield",4]
["Dallas","OSR","Dallas","Springfield",4]
["Daviess","OSR","Daviess","Kansas City",1]
["Dekalb","OSR","Dekalb","Kansas City",1]
["Dent","OSR","Dent","St. Louis",3]
["Douglas","OSR","Douglas","Springfield",4]
["Dunklin","OSR","Dunklin","St. Louis",3]
["Franklin","STL","Franklin","St. Louis",3]
["Gasconade","OSR","Gasconade","St. Louis",3]
["Gentry","OSR","Gentry","Kansas City",1]
["Greene","OSM","Greene","Springfield",4]
["Grundy","OSR","Grundy","Kansas City",1]
["Harrison","OSR","Harrison","Kansas City",1]
["Henry","OSR","Henry","Kansas City",1]
["Hickory","OSR","Hickory","Columbia",2]
["Holt","OSR","Holt","Kansas City",1]
["Howard","OSM","Howard","Columbia",2]
["Howell","OSR","Howell","Springfield",4]
["Iron","OSR","Iron","St. Louis",3]
["Jackson","KC","Jackson","Kansas City",1]
["Jasper","OSM","Jasper","Springfield",4]
["Jefferson","STL","Jefferson","St. Louis",3]
["Johnson","OSR","Johnson","Kansas City",1]
["Knox","OSR","Knox","Columbia",2]
["Laclede","OSR","Laclede","Springfield",4]
["Lafayette","OSR","Lafayette","Kansas City",1]
["Lawrence","OSR","Lawrence","Springfield",4]
["Lewis","OSR","Lewis","Columbia",2]
["Lincoln","OSR","Lincoln","St. Louis",3]
["Linn","OSR","Linn","Columbia",2]
["Livingston","OSR","Livingston","Kansas City",1]
["Macon","OSR","Macon","Columbia",2]
["Madison","OSR","Madison","St. Louis",3]
["Maries","OSR","Maries","Columbia",2]
["Marion","OSR","Marion","Columbia",2]
["McDonald","OSR","McDonald","Springfield",4]
["Mercer","OSR","Mercer","Kansas City",1]
["Miller","OSR","Miller","Columbia",2]
["Mississippi","OSR","Mississippi","St. Louis",3]
["Moniteau","SOM","Moniteau","Columbia",2]
["Monroe","OSR","Monroe","Columbia",2]
["Montgomery","OSR","Montgomery","St. Louis",3]
["Morgan","OSR","Morgan","Columbia",2]
["New Madrid","OSR","New Madrid","St. Louis",3]
["Newton","OSM","Newton","Springfield",4]
["Nodaway","OSR","Nodaway","Kansas City",1]
["Oregon","OSR","Oregon","St. Louis",3]
["Osage","OSM","OSRage","Columbia",2]
["Ozark","OSR","Ozark","Springfield",4]
["Pemiscot","OSR","Pemiscot","St. Louis",3]
["Perry","OSR","Perry","St. Louis",3]
["Pettis","OSR","Pettis","Columbia",2]
["Phelps","OSR","Phelps","Springfield",4]
["Pike","OSR","Pike","St. Louis",3]
["Platte","KC","Platte","Kansas City",1]
["Polk","OSR","Polk","Springfield",4]
["Pulaski","OSR","Pulaski","Springfield",4]
["Putnam","OSR","Putnam","Columbia",2]
["Ralls","OSR","Ralls","Columbia",2]
["Randolph","OSR","Randolph","Columbia",2]
["Ray","KC","Ray","Kansas City",1]
["Reynolds","OSR","Reynolds","St. Louis",3]
["Ripley","OSR","Ripley","St. Louis",3]
["Saline","OSR","Saline","Columbia",2]
["Schuyler","OSR","Schuyler","Columbia",2]
["Scotland","OSR","Scotland","Columbia",2]
["Scott","OSR","Scott","St. Louis",3]
["Select","NA","Select","NA",9]
["Shannon","OSR","Shannon","St. Louis",3]
["Shelby","OSR","Shelby","Columbia",2]
["St Charles","STL","St Charles","St. Louis",3]
["St Clair","OSR","St Clair","Kansas City",1]
["St Francois","OSR","St Francois","St. Louis",3]
["St Louis City","STL","St Louis City","St. Louis",3]
["St Louis","STL","St Louis County","St. Louis",3]
["Ste Genevieve","OSR","Ste Genevieve","St. Louis",3]
["Stoddard","OSR","Stoddard","St. Louis",3]
["Stone","OSR","Stone","Springfield",4]
["Sullivan","OSR","Sullivan","Columbia",2]
["Taney","OSR","Taney","Springfield",4]
["Texas","OSR","Texas","Springfield",4]
["Vernon","OSR","Vernon","Kansas City",1]
["Warren","OSR","Warren","St. Louis",3]
["Washington","OSR","Washington","St. Louis",3]
["Wayne","OSR","Wayne","St. Louis",3]
["Webster","OSR","Webster","Springfield",4]
["Worth","OSR","Worth","Kansas City",1]
["Wright","OSR","Wright","Springfield",4]

{"sheet":"CB and US Counties NEW","index":6,"n_rows":142,"n_cols":8,"rows_kept":142,"cut":false,"hidden":true,"merged":[[0,0,0,26],[1,0,1,26]]}
["Severe Cost Burdened Renter Households"]
["(For use with 2025 QAP)"]
[]
["County","Total Households","Renter Households","Renter Households w/ 50% or more CB","% of All Households","Severe Cost Burden % of All Renter Households"]
["Hickory",4010,665,225,5.6109725685785539E-2,0.33834586466165412,10,5]
["Oregon",4300,1160,330,7.6744186046511634E-2,0.28448275862068967,10,0]
["Pemiscot",6640,3095,880,0.13253012048192772,0.28432956381260099,10,0]
["Benton",8060,1365,355,4.4044665012406947E-2,0.26007326007326009,10,0]
["Bollinger",4425,770,195,4.4067796610169491E-2,0.25324675324675322,10,0]
["Boone",71920,31630,7910,0.10998331479421579,0.25007903888713245,10,0]
["St Louis City",143565,80230,19040,0.13262285375962107,0.23731771157920978,10,0]
["Greene",127530,55785,12985,0.10181917980083117,0.23276866541184907,10,0]
["Barton",4830,1510,345,7.1428571428571425E-2,0.22847682119205298,10,0]
["Madison",4850,1430,320,6.5979381443298971E-2,0.22377622377622378,10,0]
["Cape Girardeau",30215,10300,2260,7.4797286116167469E-2,0.21941747572815534,10,0]
["Lincoln",19820,3900,845,4.2633703329969727E-2,0.21666666666666667,10,0]
["Ripley",4975,980,210,4.2211055276381908E-2,0.21428571428571427,10,0]
["Phelps",18215,7320,1565,8.5918199286302496E-2,0.21379781420765026,10,0]
["Adair",9080,3490,745,8.2048458149779735E-2,0.21346704871060171,10,0]
["Warren",13130,2690,569,4.3335872048743333E-2,0.21152416356877324,10,0]
["Jackson",291530,121135,25250,8.6612012485850515E-2,0.20844512320964215,10,0]
["Buchanan",33640,12760,2635,7.8329369797859691E-2,0.20650470219435738,10,0]
["St Louis",409660,129945,26760,6.5322462529902842E-2,0.20593327946438877,10,0]
["Putnam",1700,360,74,4.3529411764705879E-2,0.20555555555555555,10,0]
["Vernon",8295,2165,435,5.2441229656419529E-2,0.20092378752886836,10,0]
["Harrison",3360,1050,209,6.2202380952380953E-2,0.19904761904761906,7,0]
["Dunklin",12120,4645,920,7.590759075907591E-2,0.19806243272335844,7,0]
["Nodaway",8510,3565,705,8.2843713278495892E-2,0.19775596072931276,7,0]
["Cooper",6340,1630,320,5.0473186119873815E-2,0.19631901840490798,7,0]
["Howell",15555,4945,955,6.1395049823207974E-2,0.19312436804853386,7,0]
["Ralls",4130,600,115,2.784503631961259E-2,0.19166666666666668,7,5]
["Jasper",46460,16905,3185,6.8553594489883768E-2,0.18840579710144928,7,0]
["Crawford",9800,2660,499,5.0918367346938775E-2,0.18759398496240601,7,0]
["Mississippi",5000,1970,369,7.3800000000000004E-2,0.18730964467005076,7,0]
["Scott",15340,5185,960,6.2581486310299875E-2,0.18514946962391515,7,0]
["Barry",13870,3595,660,4.7584715212689255E-2,0.1835883171070932,7,0]
["Wright",6975,1690,305,4.3727598566308243E-2,0.18047337278106509,7,5]
["Wayne",5440,1370,240,4.4117647058823532E-2,0.17518248175182483,7,0]
["New Madrid",7280,2740,480,6.5934065934065936E-2,0.17518248175182483,7,5]
["Ray",8765,1945,340,3.8790644609241302E-2,0.17480719794344474,7,0]
["Texas",9850,2345,408,4.1421319796954313E-2,0.17398720682302771,7,0]
["Pettis",16195,5000,865,5.3411546773695584E-2,0.17299999999999999,7,0]
["Randolph",8870,2570,444,5.0056369785794814E-2,0.17276264591439688,7,0]
["Polk",11835,3675,630,5.3231939163498096E-2,0.17142857142857143,7,0]
["St Francois",24570,7880,1345,5.4741554741554739E-2,0.17068527918781726,7,0]
["Lafayette",12710,3700,625,4.9173878835562547E-2,0.16891891891891891,7,0]
["Howard",3460,705,119,3.4393063583815026E-2,0.16879432624113475,7,0]
["Scotland",1685,360,60,3.5608308605341248E-2,0.16666666666666666,7,0]
["Franklin",41125,9360,1539,3.7422492401215805E-2,0.16442307692307692,7,0]
["Clay",92515,29270,4805,5.1937523644814354E-2,0.16416125725999317,7,0]
["St Charles",149470,27570,4460,2.9838763631497959E-2,0.16177003989844033,7,0]
["Dent",6355,1810,290,4.5633359559402044E-2,0.16022099447513813,7,5]
["Johnson",19930,7490,1200,6.0210737581535376E-2,0.1602136181575434,7,0]
["Camden",17300,3205,510,2.9479768786127167E-2,0.15912636505460218,7,0]
["Dallas",6410,1575,250,3.9001560062402497E-2,0.15873015873015872,7,0]
["Douglas",5315,925,145,2.7281279397930385E-2,0.15675675675675677,7,0]
["Taney",22390,7720,1209,5.3997320232246536E-2,0.15660621761658031,7,0]
["Cass",40395,9920,1545,3.8247307835128107E-2,0.15574596774193547,7,0]
["Washington",9280,2185,339,3.6530172413793104E-2,0.15514874141876431,7,0]
["Audrain",9350,2755,425,4.5454545454545456E-2,0.15426497277676951,5,0]
["Maries",3810,1010,154,4.0419947506561679E-2,0.15247524752475247,7,0]
["Stoddard",11545,3460,524,4.5387613685578171E-2,0.15144508670520232,7,0]
["Ste Genevieve",7250,1385,209,2.8827586206896551E-2,0.15090252707581228,7,0]
["Butler",16360,5905,890,5.4400977995110025E-2,0.15071972904318373,7,0]
["DeKalb",3800,1155,174,4.5789473684210526E-2,0.15064935064935064,7,0]
["Bates",6565,1965,295,4.4935262757044937E-2,0.15012722646310434,5,0]
["Cedar",5575,1675,250,4.4843049327354258E-2,0.14925373134328357,7,5]
["Morgan",7640,1435,214,2.8010471204188481E-2,0.14912891986062718,10,0]
["Pulaski",15060,7185,1070,7.1049136786188585E-2,0.14892136395267919,7,0]
["Henry",9285,2680,398,4.2864835756596664E-2,0.14850746268656717,7,0]
["Christian",32485,8215,1205,3.7094043404648301E-2,0.14668289713937918,7,0]
["Iron",4100,1100,160,3.9024390243902439E-2,0.14545454545454545,7,5]
["Jefferson",84980,17395,2525,2.9712873617321722E-2,0.14515665421098017,7,0]
["Marion",11535,4070,590,5.1148677936714348E-2,0.14496314496314497,7,0]
["Newton",22125,6125,875,3.954802259887006E-2,0.14285714285714285,5,0]
["Stone",12690,2120,300,2.3640661938534278E-2,0.14150943396226415,5,0]
["Platte",39920,13110,1780,4.458917835671343E-2,0.13577421815408086,5,0]
["Clark",2635,630,85,3.2258064516129031E-2,0.13492063492063491,5,0]
["Linn",5000,1205,159,3.1800000000000002E-2,0.13195020746887967,5,0]
["Laclede",14415,4620,609,4.2247658688865763E-2,0.13181818181818181,5,0]
["Pike",6655,1900,250,3.7565740045078885E-2,0.13157894736842105,5,0]
["Livingston",5905,1965,255,4.3183742591024553E-2,0.12977099236641221,7,0]
["Caldwell",3705,885,114,3.0769230769230771E-2,0.12881355932203389,5,0]
["Worth",810,150,19,2.3456790123456792E-2,0.12666666666666668,5,0]
["Lawrence",14850,4265,525,3.5353535353535352E-2,0.123094958968347,5,0]
["Mercer",1335,285,35,2.6217228464419477E-2,0.12280701754385964,0,0]
["Macon",5910,1515,185,3.1302876480541454E-2,0.12211221122112212,5,0]
["Chariton",2725,620,74,2.7155963302752294E-2,0.11935483870967742,7,0]
["Reynolds",2580,465,55,2.1317829457364341E-2,0.11827956989247312,5,0]
["Moniteau",5450,1280,149,2.7339449541284404E-2,0.11640625,5,0]
["Webster",13695,2985,345,2.5191675794085433E-2,0.11557788944723618,5,0]
["Cole",30290,9960,1150,3.7966325519973587E-2,0.11546184738955824,5,0]
["Daviess",3000,600,68,2.2666666666666668E-2,0.11333333333333333,5,5]
["Osage",5275,855,94,1.7819905213270142E-2,0.10994152046783626,0,0]
["Grundy",3900,1280,140,3.5897435897435895E-2,0.109375,5,0]
["Clinton",8100,1795,195,2.4074074074074074E-2,0.10863509749303621,5,0]
["Atchison",2550,785,85,3.3333333333333333E-2,0.10828025477707007,5,0]
["Lewis",3595,845,89,2.4756606397774689E-2,0.10532544378698225,5,0]
["Montgomery",4995,1365,140,2.8028028028028028E-2,0.10256410256410256,5,0]
["Monroe",3730,930,95,2.5469168900804289E-2,0.10215053763440861,5,0]
["Callaway",16235,4130,400,2.4638127502309825E-2,9.6852300242130748E-2,5,0]
["Holt",2010,470,45,2.2388059701492536E-2,9.5744680851063829E-2,0,0]
["Saline",8235,2405,225,2.7322404371584699E-2,9.355509355509356E-2,5,0]
["McDonald",8395,2680,250,2.9779630732578916E-2,9.3283582089552244E-2,0,5]
["Andrew",6800,1460,135,1.9852941176470587E-2,9.2465753424657529E-2,0,5]
["Schuyler",1440,440,40,2.7777777777777776E-2,9.0909090909090912E-2,5,0]
["Knox",1400,210,19,1.3571428571428571E-2,9.0476190476190474E-2,0,0]
["Shannon",3065,770,65,2.1207177814029365E-2,8.4415584415584416E-2,5,0]
["St Clair",4120,805,64,1.5533980582524271E-2,7.9503105590062115E-2,5,0]
["Perry",7575,2000,150,1.9801980198019802E-2,7.4999999999999997E-2,5,0]
["Gentry",2495,600,44,1.7635270541082163E-2,7.3333333333333334E-2,0,0]
["Ozark",4080,840,59,1.4460784313725491E-2,7.0238095238095238E-2,7,0]
["Miller",10450,2770,190,1.8181818181818181E-2,6.8592057761732855E-2,5,0]
["Dade",3030,790,54,1.782178217821782E-2,6.8354430379746839E-2,5,0]
["Carroll",3520,970,65,1.8465909090909092E-2,6.7010309278350513E-2,0,0]
["Gasconade",6155,1285,85,1.380991064175467E-2,6.6147859922178989E-2,0,0]
["Carter",2335,660,40,1.7130620985010708E-2,6.0606060606060608E-2,5,0]
["Shelby",2485,605,29,1.1670020120724347E-2,4.7933884297520664E-2,0,0]
["Sullivan",2220,585,25,1.1261261261261261E-2,4.2735042735042736E-2,0,0]
[null,null,null,null,null,null,null,{"$f":"SUM(H5:H119)","v":50}]
[]
[]
[]
[]
[]
[]
[]
[]
[]
[]
[]
[]
[]
[]
[]
[]
[]
[]
[null,null,null,null,null,"Select"]
[null,null,null,null,null,"Service Enriched"]
[null,null,null,null,null,"Set-Aside Preference"]
[null,null,null,null,null,"Both"]

{"sheet":"CHAS","index":7,"n_rows":1148,"n_cols":8,"rows_kept":1148,"cut":false,"hidden":true,"merged":[]}
["County","Rent Burden <=30%","Rent Burden >30% to <=50%","Rent Burden >50%","Rent Burden not available","Total Rented","30% + 50% Rent Burdened","% Rent Burdened"]
["Clark",575,100,20,10,700,120,0.17391304347826086]
["Mercer",285,33,39,10,360,72,0.20571428571428571]
["Gentry",555,89,59,0,695,148,0.21294964028776978]
["Worth",185,38,18,4,240,56,0.23728813559322035]
["Atchison",570,113,70,10,765,183,0.24238410596026491]
["Shelby",510,125,40,4,675,165,0.24590163934426229]
["Lewis",785,145,115,10,1050,260,0.25]
["DeKalb",1045,205,144,4,1395,349,0.25089863407620416]
["Shannon",575,104,90,10,780,194,0.25194805194805192]
["Schuyler",365,48,85,15,515,133,0.26600000000000001]
["Holt",465,93,74,15,640,167,0.26719999999999999]
["Pike",1290,340,165,35,1830,505,0.28133704735376047]
["Daviess",475,90,99,4,665,189,0.28593040847201212]
["Maries",665,149,119,4,940,268,0.28632478632478631]
["Sullivan",430,75,100,10,620,175,0.28688524590163933]
["McDonald",1625,315,345,35,2325,660,0.28820960698689957]
["Knox",280,73,40,0,390,113,0.28974358974358977]
["Livingston",1215,239,270,115,1845,509,0.29421965317919074]
["Chariton",475,85,114,4,680,199,0.29437869822485208]
["Osage",595,179,78,35,880,257,0.30414201183431955]
["Lawrence",2785,623,600,50,4060,1223,0.30498753117206984]
["Andrew",1030,274,179,85,1570,453,0.30505050505050507]
["Ralls",495,75,145,0,715,220,0.30769230769230771]
["Bates",1330,350,250,10,1940,600,0.31088082901554404]
["Dallas",1125,244,270,20,1665,514,0.31246200607902735]
["Macon",1075,345,145,35,1595,490,0.3141025641025641]
["Cole",6255,1580,1385,310,9535,2965,0.3214092140921409]
["Scotland",315,50,100,4,465,150,0.32537960954446854]
["St Clair",615,180,115,10,915,295,0.32596685082872928]
["Harrison",685,165,172,10,1035,337,0.32878048780487806]
["Iron",810,179,225,25,1235,404,0.33388429752066118]
["Grundy",840,165,255,15,1270,420,0.33466135458167329]
["Monroe",610,200,110,15,940,310,0.33513513513513515]
["Linn",865,230,210,4,1310,440,0.33690658499234305]
["Audrain",1855,580,365,115,2910,945,0.33810375670840787]
["Perry",1065,385,175,10,1635,560,0.3446153846153846]
["Webster",2335,680,560,50,3625,1240,0.34685314685314683]
["Caldwell",600,129,194,10,940,323,0.34731182795698923]
["Dent",1065,340,230,55,1685,570,0.34969325153374231]
["Reynolds",340,80,105,4,530,185,0.35171102661596959]
["Pulaski",4930,1410,1285,150,7780,2695,0.35321100917431192]
["Cooper",1220,370,300,35,1925,670,0.35449735449735448]
["Washington",1040,260,320,25,1645,580,0.35802469135802467]
["Marion",2425,760,605,115,3915,1365,0.35921052631578948]
["Callaway",2830,840,745,65,4475,1585,0.35941043083900226]
["Moniteau",905,399,115,10,1430,514,0.36197183098591551]
["Clinton",1345,410,355,15,2125,765,0.36255924170616116]
["Ray",1235,465,235,10,1940,700,0.36269430051813473]
["Bollinger",550,170,149,40,915,319,0.36457142857142855]
["Ste Genevieve ",995,293,274,0,1555,567,0.36463022508038584]
["Newton",4035,1380,945,85,6450,2325,0.3652788688138256]
["Lafayette",2130,555,675,80,3445,1230,0.36552748885586922]
["Henry",1480,495,364,25,2360,859,0.36788008565310493]
["Wright",1440,445,405,80,2375,850,0.37037037037037035]
["Dade",435,119,138,10,700,257,0.37246376811594201]
["Miller",1415,575,280,15,2285,855,0.37665198237885461]
["Franklin",6700,2300,1765,130,10895,4065,0.37761263353460289]
["Clay",16380,5545,4394,315,26635,9939,0.37762158054711248]
["Morgan",1195,315,414,45,1970,729,0.37870129870129871]
["Scott",2895,770,1010,65,4745,1780,0.38034188034188032]
["Platte",8155,2560,2515,110,13340,5075,0.3835978835978836]
["Ripley",810,305,195,15,1315,500,0.38461538461538464]
["St Charles",17400,6030,4860,365,28665,10890,0.38480565371024733]
["Jefferson",9805,2885,3250,160,16100,6135,0.38488080301129235]
["Carter",455,170,114,4,740,284,0.3858695652173913]
["Gasconade",945,265,335,15,1565,600,0.38709677419354838]
["Stoddard",2210,905,499,45,3660,1404,0.38838174273858922]
["Howell",2955,880,1020,80,4940,1900,0.39094650205761317]
["Putnam",315,143,65,50,580,208,0.39245283018867927]
["Cass",5630,1930,1740,130,9425,3670,0.39483593329747174]
["Taney",5415,2025,1515,145,9105,3540,0.3950892857142857]
["Barton",900,385,205,60,1550,590,0.39597315436241609]
["Carroll",560,230,144,4,945,374,0.39744952178533477]
["Saline",1700,624,505,30,2865,1129,0.39823633156966493]
["Montgomery",795,195,330,15,1330,525,0.39923954372623577]
["Barry",1965,640,670,55,3330,1310,0.4]
["Pettis",3130,1110,985,75,5300,2095,0.40095693779904307]
["Cape Girardeau",5980,1840,2220,475,10510,4060,0.40458395615346288]
["Vernon",1650,504,625,30,2810,1129,0.40611510791366906]
["Howard",525,224,130,45,915,354,0.40689655172413791]
["St Francois",4625,1349,1835,140,7950,3184,0.40768245838668377]
["Mississippi",1220,395,450,45,2105,845,0.41019417475728154]
["Texas",1465,444,600,55,2570,1044,0.41510934393638171]
["Christian",4615,1950,1390,100,8050,3340,0.42012578616352203]
["Stone",1540,585,529,30,2680,1114,0.42037735849056601]
["New Madrid",1620,604,585,70,2885,1189,0.42238010657193603]
["Lincoln",2400,795,965,170,4335,1760,0.42256902761104442]
["Cedar",1085,520,270,4,1870,790,0.42336548767416937]
["Dunklin",2675,1015,975,70,4730,1990,0.42703862660944208]
["Pemiscot",1765,715,604,150,3235,1319,0.42755267423014587]
["Crawford",1435,484,603,35,2570,1087,0.42879684418145958]
["Hickory",410,170,140,45,760,310,0.43356643356643354]
["St Louis",67035,25965,25780,2940,121725,51745,0.43561897545986444]
["Jasper",9060,3685,3310,220,16270,6995,0.43582554517133959]
["Buchanan",6815,2570,2720,235,12335,5290,0.43719008264462811]
["Ozark",535,250,170,30,990,420,0.4375]
["Butler",3245,1405,1190,145,5990,2595,0.44396920444824639]
["Nodaway",2010,744,893,110,3760,1637,0.44849315068493151]
["Wayne",710,285,290,35,1315,575,0.44921875]
["Camden",2000,870,764,30,3665,1634,0.44951856946354884]
["Phelps",3450,1430,1400,390,6675,2830,0.45027844073190137]
["Laclede",2405,755,1220,25,4400,1975,0.4514285714285714]
["Randolph",1200,454,535,30,2215,989,0.45263157894736844]
["Johnson",4360,1785,1830,115,8090,3615,0.45329153605015676]
["Jackson",61145,23710,26985,3175,115005,50695,0.4533220066171868]
["Douglas",625,260,255,4,1140,515,0.45334507042253519]
["Warren",1395,580,580,60,2615,1160,0.45401174168297453]
["Polk",2135,1035,815,30,4005,1850,0.46540880503144655]
["Madison",630,325,225,10,1190,550,0.46610169491525422]
["Benton",755,275,389,75,1495,664,0.46760563380281689]
["Greene",25365,11155,11700,1455,49675,22855,0.47397345499792615]
["Oregon",505,265,224,10,1010,489,0.48899999999999999]
["St Louis City",38540,16575,20934,3465,79515,37509,0.49321499013806708]
["Boone",14535,6115,8520,1610,30785,14635,0.50162810625535559]
["Adair",1540,730,1245,345,3875,1975,0.55949008498583575]
[""]
[""]
[""]
[""]
[""]
[""]
[""]
[""]
[""]
[""]
[""]
[""]
[""]
[""]
[""]
[""]
[""]
[""]
[""]
[""]
[""]
[""]
[""]
[""]
[""]
[""]
[""]
[""]
[""]
[""]
[""]
[""]
[""]
[""]
[""]
[""]
[""]
[""]
[""]
[""]
[""]
[""]
[""]
[""]
[""]
[""]
[""]
[""]
[""]
[""]
[""]
[""]
[""]
[""]
[""]
[""]
[""]
[""]
[""]
[""]
[""]
[""]
[""]
[""]
[""]
[""]
[""]
[""]
[""]
[""]
[""]
[""]
[""]
[""]
[""]
[""]
[""]
[""]
[""]
[""]
[""]
[""]
[""]
[""]
[""]
[""]
[""]
[""]
[""]
[""]
[""]
[""]
[""]
[""]
[""]
[""]
[""]
[""]
[""]
[""]
[""]
[""]
[""]
[""]
[""]
[""]
[""]
[""]
[""]
[""]
[""]
[""]
[""]
[""]
[""]
[""]
[""]
[""]
[""]
[""]
[""]
[""]
[""]
[""]
[""]
[""]
[""]
[""]
[""]
[""]
[""]
[""]
[""]
[""]
[""]
[""]
[""]
[""]
[""]
[""]
[""]
[""]
[""]
[""]
[""]
[""]
[""]
[""]
[""]
[""]
[""]
[""]
[""]
[""]
[""]
[""]
[""]
[""]
[""]
[""]
[""]
[""]
[""]
[""]
[""]
[""]
[""]
[""]
[""]
[""]
[""]
[""]
[""]
[""]
[""]
[""]
[""]
[""]
[""]
[""]
[""]
[""]
[""]
[""]
[""]
[""]
[""]
[""]
[""]
[""]
[""]
[""]
[""]
[""]
[""]
[""]
[""]
[""]
[""]
[""]
[""]
[""]
[""]
[""]
[""]
[""]
[""]
[""]
[""]
[""]
[""]
[""]
[""]
[""]
[""]
[""]
[""]
[""]
[""]
[""]
[""]
[""]
[""]
[""]
[""]
[""]
[""]
[""]
[""]
[""]
[""]
[""]
[""]
[""]
[""]
[""]
[""]
[""]
[""]
[""]
[""]
[""]
[""]
[""]
[""]
[""]
[""]
[""]
[""]
[""]
[""]
[""]
[""]
[""]
[""]
[""]
[""]
[""]
[""]
[""]
[""]
[""]
[""]
[""]
[""]
[""]
[""]
[""]
[""]
[""]
[""]
[""]
[""]
[""]
[""]
[""]
[""]
[""]
[""]
[""]
[""]
[""]
[""]
[""]
[""]
[""]
[""]
[""]
[""]
[""]
[""]
[""]
[""]
[""]
[""]
[""]
[""]
[""]
[""]
[""]
[""]
[""]
[""]
[""]
[""]
[""]
[""]
[""]
[""]
[""]
[""]
[""]
[""]
[""]
[""]
[""]
[""]
[""]
[""]
[""]
[""]
[""]
[""]
[""]
[""]
[""]
[""]
[""]
[""]
[""]
[""]
[""]
[""]
[""]
[""]
[""]
[""]
[""]
[""]
[""]
[""]
[""]
[""]
[""]
[""]
[""]
[""]
[""]
[""]
[""]
[""]
[""]
[""]
[""]
[""]
[""]
[""]
[""]
[""]
[""]
[""]
[""]
[""]
[""]
[""]
[""]
[""]
[""]
[""]
[""]
[""]
[""]
[""]
[""]
[""]
[""]
[""]
[""]
[""]
[""]
[""]
[""]
[""]
[""]
[""]
[""]
[""]
[""]
[""]
[""]
[""]
[""]
[""]
[""]
[""]
[""]
[""]
[""]
[""]
[""]
[""]
[""]
[""]
[""]
[""]
[""]
[""]
[""]
[""]
[""]
[""]
[""]
[""]
[""]
[""]
[""]
[""]
[""]
[""]
[""]
[""]
[""]
[""]
[""]
[""]
[""]
[""]
[""]
[""]
[""]
[""]
[""]
[""]
[""]
[""]
[""]
[""]
[""]
[""]
[""]
[""]
[""]
[""]
[""]
[""]
[""]
[""]
[""]
[""]
[""]
[""]
[""]
[""]
[""]
[""]
[""]
[""]
[""]
[""]
[""]
[""]
[""]
[""]
[""]
[""]
[""]
[""]
[""]
[""]
[""]
[""]
[""]
[""]
[""]
[""]
[""]
[""]
[""]
[""]
[""]
[""]
[""]
[""]
[""]
[""]
[""]
[""]
[""]
[""]
[""]
[""]
[""]
[""]
[""]
[""]
[""]
[""]
[""]
[""]
[""]
[""]
[""]
[""]
[""]
[""]
[""]
[""]
[""]
[""]
[""]
[""]
[""]
[""]
[""]
[""]
[""]
[""]
[""]
[""]
[""]
[""]
[""]
[""]
[""]
[""]
[""]
[""]
[""]
[""]
[""]
[""]
[""]
[""]
[""]
[""]
[""]
[""]
[""]
[""]
[""]
[""]
[""]
[""]
[""]
[""]
[""]
[""]
[""]
[""]
[""]
[""]
[""]
[""]
[""]
[""]
[""]
[""]
[""]
[""]
[""]
[""]
[""]
[""]
[""]
[""]
[""]
[""]
[""]
[""]
[""]
[""]
[""]
[""]
[""]
[""]
[""]
[""]
[""]
[""]
[""]
[""]
[""]
[""]
[""]
[""]
[""]
[""]
[""]
[""]
[""]
[""]
[""]
[""]
[""]
[""]
[""]
[""]
[""]
[""]
[""]
[""]
[""]
[""]
[""]
[""]
[""]
[""]
[""]
[""]
[""]
[""]
[""]
[""]
[""]
[""]
[""]
[""]
[""]
[""]
[""]
[""]
[""]
[""]
[""]
[""]
[""]
[""]
[""]
[""]
[""]
[""]
[""]
[""]
[""]
[""]
[""]
[""]
[""]
[""]
[""]
[""]
[""]
[""]
[""]
[""]
[""]
[""]
[""]
[""]
[""]
[""]
[""]
[""]
[""]
[""]
[""]
[""]
[""]
[""]
[""]
[""]
[""]
[""]
[""]
[""]
[""]
[""]
[""]
[""]
[""]
[""]
[""]
[""]
[""]
[""]
[""]
[""]
[""]
[""]
[""]
[""]
[""]
[""]
[""]
[""]
[""]
[""]
[""]
[""]
[""]
[""]
[""]
[""]
[""]
[""]
[""]
[""]
[""]
[""]
[""]
[""]
[""]
[""]
[""]
[""]
[""]
[""]
[""]
[""]
[""]
[""]
[""]
[""]
[""]
[""]
[""]
[""]
[""]
[""]
[""]
[""]
[""]
[""]
[""]
[""]
[""]
[""]
[""]
[""]
[""]
[""]
[""]
[""]
[""]
[""]
[""]
[""]
[""]
[""]
[""]
[""]
[""]
[""]
[""]
[""]
[""]
[""]
[""]
[""]
[""]
[""]
[""]
[""]
[""]
[""]
[""]
[""]
[""]
[""]
[""]
[""]
[""]
[""]
[""]
[""]
[""]
[""]
[""]
[""]
[""]
[""]
[""]
[""]
[""]
[""]
[""]
[""]
[""]
[""]
[""]
[""]
[""]
[""]
[""]
[""]
[""]
[""]
[""]
[""]
[""]
[""]
[""]
[""]
[""]
[""]
[""]
[""]
[""]
[""]
[""]
[""]
[""]
[""]
[""]
[""]
[""]
[""]
[""]
[""]
[""]
[""]
[""]
[""]
[""]
[""]
[""]
[""]
[""]
[""]
[""]
[""]
[""]
[""]
[""]
[""]
[""]
[""]
[""]
[""]
[""]
[""]
[""]
[""]
[""]
[""]
[""]
[""]
[""]
[""]
[""]
[""]
[""]
[""]
[""]
[""]
[""]
[""]
[""]
[""]
[""]
[""]
[""]
[""]
[""]
[""]
[""]
[""]
[""]
[""]
[""]
[""]
[""]
[""]
[""]
[""]
[""]
[""]
[""]
[""]
[""]
[""]
[""]
[""]
[""]
[""]
[""]
[""]
[""]
[""]
[""]
[""]
[""]
[""]
[""]
[""]
[""]
[""]
[""]
[""]
[""]
[""]
[""]
[""]
[""]
[""]
[""]
[""]
[""]
[""]
[""]
[""]
[""]
[""]
[""]
[""]
[""]
[""]
[""]
[""]
[""]
[""]
[""]
[""]
[""]
[""]
[""]
[""]
[""]
[""]
[""]
[""]
[""]
[""]
[""]
[""]
[""]
[""]
[""]
[""]
[""]
[""]
[""]
[""]
[""]
[""]
[""]
[""]
[""]
[""]
[""]
[""]
[""]
[""]
[""]
[""]
[""]
[""]
[""]
[""]
[""]
[""]
[""]
[""]
[""]
[""]
[""]
[""]
[""]
[""]
[""]
[""]
[""]
[""]
[""]
[""]
[""]
[""]
[""]
[""]
[""]
[""]
[""]
[""]
[""]
[""]
[""]
[""]
[""]
[""]
[""]
[""]
[""]
[""]
[""]
[""]
[""]
[""]
[""]
[""]
[""]
[""]
[""]
[""]
[""]
[""]
[""]
[""]
[""]
[""]
[""]
[""]
[""]
[""]
[""]
[""]
[""]
[""]
[""]
[""]
[""]
[""]
[""]
[""]
[""]
[""]
[""]
[""]
[""]
[""]
[""]
[""]
[""]
[""]
[""]
[""]
[""]
[""]
[""]
[""]
[""]
[""]
[""]

{"sheet":"CHAS NEW","index":8,"n_rows":116,"n_cols":8,"rows_kept":116,"cut":false,"hidden":true,"merged":[]}
["County","Rent Burden <=30%","Rent Burden >30% to <=50%","Rent Burden >50%","Rent Burden not available","Total Rented","30% + 50% Rent Burdened","% Rent Burdened"]
["Holt",395,24,45,4,470,69,0.14680851063829786]
["Montgomery",1070,100,140,55,1365,240,0.17582417582417584]
["Shelby",490,79,29,4,605,108,0.17851239669421487]
["Schuyler",350,39,40,15,440,79,0.17954545454545454]
["Gentry",465,74,44,15,600,118,0.19666666666666666]
["St Clair",640,95,64,4,805,159,0.19751552795031055]
["Grundy",1015,119,140,4,1280,259,0.20234374999999999]
["Morgan",1105,93,214,30,1435,307,0.21393728222996516]
["Sullivan",440,103,25,4,585,128,0.2188034188034188]
["Monroe",680,109,95,50,930,204,0.21935483870967742]
["Atchison",605,90,85,10,785,175,0.22292993630573249]
["DeKalb",890,84,174,4,1155,258,0.22337662337662337]
["Ste Genevieve",1050,105,209,30,1385,314,0.22671480144404332]
["Miller",1990,439,190,155,2770,629,0.22707581227436824]
["Knox",155,29,19,4,210,48,0.22857142857142856]
["Osage",625,105,94,25,855,199,0.2327485380116959]
["Mercer",200,32,35,10,285,67,0.23508771929824562]
["Dade",585,140,54,10,790,194,0.24556962025316456]
["McDonald",1980,409,250,45,2680,659,0.2458955223880597]
["Ozark",520,150,59,105,840,209,0.24880952380952381]
["Carter",500,125,40,0,660,165,0.25]
["Chariton",450,84,74,10,620,158,0.25483870967741934]
["Gasconade",910,250,85,35,1285,335,0.26070038910505838]
["Caldwell",650,119,114,10,885,233,0.26327683615819208]
["Shannon",500,140,65,70,770,205,0.26623376623376621]
["Laclede",3325,630,609,55,4620,1239,0.26818181818181819]
["Maries",735,120,154,0,1010,274,0.27128712871287131]
["Linn",865,175,159,10,1205,334,0.27717842323651454]
["Cedar",1105,215,250,105,1675,465,0.27761194029850744]
["Carroll",699,205,65,0,970,270,0.27835051546391754]
["Worth",114,23,19,0,150,42,0.28000000000000003]
["Washington",1520,285,339,35,2185,624,0.28558352402745996]
["Pike",1350,295,250,4,1900,545,0.2868421052631579]
["Wayne",915,153,240,65,1370,393,0.28686131386861313]
["Moniteau",895,220,149,15,1280,369,0.28828124999999999]
["Pulaski",5015,1040,1070,65,7185,2110,0.29366736256089077]
["Livingston",1370,325,255,15,1965,580,0.2951653944020356]
["Ralls",395,64,115,25,600,179,0.29833333333333334]
["Putnam",250,34,74,4,360,108,0.3]
["Andrew",1010,305,135,10,1460,440,0.30136986301369861]
["Cole",6675,1875,1150,250,9960,3025,0.30371485943775101]
["Daviess",405,115,68,4,600,183,0.30499999999999999]
["Clinton",1240,355,195,4,1795,550,0.30640668523676878]
["Lafayette",2520,510,625,40,3700,1135,0.30675675675675673]
["Clark",420,110,85,15,630,195,0.30952380952380953]
["Marion",2605,675,590,195,4070,1265,0.3108108108108108]
["Reynolds",320,90,55,0,465,145,0.31182795698924731]
["Platte",8875,2319,1780,145,13110,4099,0.31266209000762779]
["Audrain",1825,443,425,60,2755,868,0.31506352087114337]
["Webster",1980,600,345,55,2985,945,0.3165829145728643]
["Howell",3065,614,955,315,4945,1569,0.31729019211324572]
["Stone",1410,373,300,30,2120,673,0.31745283018867926]
["Lawrence",2835,830,525,70,4265,1355,0.31770222743259086]
["Douglas",600,150,145,30,925,295,0.31891891891891894]
["Stoddard",2210,594,524,125,3460,1118,0.32312138728323697]
["Newton",4100,1105,875,40,6125,1980,0.32326530612244897]
["New Madrid",1775,409,480,70,2740,889,0.32445255474452556]
["Callaway",2650,940,400,140,4130,1340,0.32445520581113801]
["Scotland",239,59,60,0,360,119,0.33055555555555555]
["Camden",1975,575,510,155,3205,1085,0.33853354134165364]
["Jefferson",11120,3365,2525,380,17395,5890,0.33860304685254383]
["Macon",980,329,185,25,1515,514,0.33927392739273926]
["Perry",1255,530,150,70,2000,680,0.34]
["Bates",1295,374,295,4,1965,669,0.34045801526717556]
["Dallas",940,289,250,95,1575,539,0.34222222222222221]
["Ray",1245,330,340,30,1945,670,0.34447300771208228]
["Christian",5265,1625,1205,115,8215,2830,0.3444917833231893]
["Dent",1130,340,290,45,1810,630,0.34806629834254144]
["Cooper",1040,250,320,20,1630,570,0.34969325153374231]
["Lincoln",2485,550,845,20,3900,1395,0.3576923076923077]
["St Charles",17270,5475,4460,360,27570,9935,0.36035545883206382]
["Taney",4815,1585,1209,110,7720,2794,0.36191709844559583]
["Pettis",3060,975,865,90,5000,1840,0.36799999999999999]
["Franklin",5820,1920,1539,90,9360,3459,0.36955128205128207]
["Texas",1375,465,408,100,2345,873,0.37228144989339018]
["Ripley",610,155,210,4,980,365,0.37244897959183676]
["Lewis",500,230,89,30,845,319,0.37751479289940826]
["Polk",2210,760,630,70,3675,1390,0.37823129251700682]
["Randolph",1555,529,444,25,2570,973,0.37859922178988326]
["Dunklin",2760,855,920,105,4645,1775,0.38213132400430572]
["Scott",3060,1025,960,135,5185,1985,0.38283510125361619]
["Buchanan",7600,2254,2635,255,12760,4889,0.38315047021943571]
["St Francois",4780,1679,1345,70,7880,3024,0.38375634517766499]
["Henry",1590,635,398,55,2680,1033,0.38544776119402985]
["Nodaway",2150,675,705,35,3565,1380,0.38709677419354838]
["Howard",430,154,119,0,705,273,0.38723404255319149]
["Saline",1405,710,225,60,2405,935,0.38877338877338879]
["Barry",2135,740,660,50,3595,1400,0.38942976356050069]
["Crawford",1555,544,499,75,2660,1043,0.39210526315789473]
["Cape Girardeau",5850,1805,2260,375,10300,4065,0.39466019417475728]
["Wright",895,365,305,130,1690,670,0.39644970414201186]
["Jasper",9815,3575,3185,325,16905,6760,0.39988169180715766]
["Madison",845,255,320,20,1430,575,0.40209790209790208]
["Cass",5885,2465,1545,30,9920,4010,0.40423387096774194]
["Clay",17110,7100,4805,250,29270,11905,0.4067304407242911]
["Barton",860,275,345,30,1510,620,0.41059602649006621]
["St. Louis",74215,26655,26760,2320,129945,53415,0.41105852476047561]
["Harrison",605,225,209,10,1050,434,0.41333333333333333]
["Benton",790,220,355,4,1365,575,0.42124542124542125]
["Vernon",1255,479,435,0,2165,914,0.42217090069284063]
["Phelps",3960,1550,1565,255,7320,3115,0.42554644808743169]
["Jackson",66690,26320,25250,2870,121135,51570,0.42572336649193049]
["St Louis City",43075,15445,19040,2670,80230,34485,0.42982674809921478]
["Adair",1635,760,745,350,3490,1505,0.43123209169054444]
["Iron",610,315,160,15,1100,475,0.43181818181818182]
["Butler",3110,1660,890,255,5905,2550,0.43183742591024554]
["Greene",29895,11135,12985,1770,55785,24120,0.43237429416509815]
["Johnson",4170,2080,1200,45,7490,3280,0.43791722296395191]
["Warren",1490,625,569,0,2690,1194,0.44386617100371745]
["Bollinger",415,154,195,10,770,349,0.45324675324675323]
["Pemiscot",1535,545,880,140,3095,1425,0.4604200323101777]
["Boone",16270,6755,7910,690,31630,14665,0.46364211191906418]
["Mississippi",945,600,369,60,1970,969,0.49187817258883249]
["Hickory",314,115,225,10,665,340,0.51127819548872178]
["Oregon",485,300,330,45,1160,630,0.5431034482758621]